Peptide,PTM,ModifiedAA,ModifiedPosition,PeptideUniqueToGene,ExperimentDesc,ExpID,PubmedID,ScoreType,IdentScore,LocProb,Log2FChange,PQ-val,QuantSig,PEP,MassErrorPPM
AADLDDLE,nt,A,2,true,"Arg/N-end rule seed, prt6 vs. Wt",99,29168982,"MASCOT Score",58.5200000,,-0.3153294,0.3515746,NO,0.01465000025928,-0.4907573
AADLDDLEEESSSSLSPPLLPPPR,nta,A,2,true,"Characterization plant N-terminal acetylation",6,22223895,"MASCOT Score",65.3000000,,,,,,
SPLNQPELWMR,ph,S,26,true,"Tissue atlas Arabidopsis - ProteomicsDB",114,32188942,"MaxQuant score",136.3800000,1.0000000,,,,1.9675001112773E-6,
HDQEDSLDAGVSIPSTTGPDLSGSPGETVPSVSEER,ph,S,384,true,"Tissue atlas Arabidopsis - ProteomicsDB",114,32188942,"MaxQuant score",130.2200000,0.9033010,,,,0,
LEISDDAMKSPCLSDKESDSPLNGK,ph,S,421,true,"Tissue atlas Arabidopsis - ProteomicsDB",114,32188942,"MaxQuant score",181.9400000,0.9999490,,,,5.0446744715693E-44,
SPCLSDKESDSPLNGK,ph,S,425,true,"atm and atr DNA damage response",88,25561503,"MASCOT Score",31.0000000,1.0000000,,,,,-0.5900000
SPCLSDKESDSPLNGK,ph,S,425,true,"Tissue atlas Arabidopsis - ProteomicsDB",114,32188942,"MaxQuant score",213.4600000,0.9999980,,,,0,
SPCLSDKESDSPLNGK,ph,S,431,true,"atm and atr DNA damage response",88,25561503,"MASCOT Score",24.0000000,1.0000000,,,,,-1.5000000
SPCLSDKESDSPLNGK,ph,S,431,true,"Tissue atlas Arabidopsis - ProteomicsDB",114,32188942,"MaxQuant score",222.5600000,0.9997980,,,,0,
HHSFNQMR,ph,S,439,true,"Tissue atlas Arabidopsis - ProteomicsDB",114,32188942,"MaxQuant score",61.5600000,1.0000000,,,,0.0073459600098431,
SMSQAHSEMNFPDR,ph,S,650,true,"Tissue atlas Arabidopsis - ProteomicsDB",114,32188942,"MaxQuant score",69.2610000,0.9300710,,,,0.00035955099156126,
APDFRPTEPLPVEVLSPPEDSKPR,ph,S,718,true,"Large-scale phosphorylation discovery",44,23111157,XCorr,6.7390000,,,,,,
APDFRPTEPLPVEVLSPPEDSKPR,ph,S,718,true,"TOR Kinase and ABA Receptor",100,29290610,XCorr,4.2872667,0.9999000,,,,1.7590000567225E-8,
APDFRPTEPLPVEVLSPPEDSKPR,ph,S,718,true,"Tissue atlas Arabidopsis - ProteomicsDB",114,32188942,"MaxQuant score",125.0200000,0.9999780,,,,2.6956399800202E-27,
