Peptide,PTM,ModifiedAA,ModifiedPosition,PeptideUniqueToGene,ExperimentDesc,ExpID,PubmedID,ScoreType,IdentScore,LocProb,Log2FChange,PQ-val,QuantSig,PEP,MassErrorPPM
VSVHDSANDSVVEDWVNTGGR,ng,N,101,true,"Conserved N-glycosylation",74,22633491,"MaxQuant Score",259.3500000,1.0000000,,,,0,0.6080000
VSVHDSANDSVVEDWVNTGGR,ng,N,101,true,"ER-associatied N-glycan degradation chilling stres",133,27558752,,,,,,,,
VSVHDSANDSVVEDWVNTGGR,ng,N,101,true,"N-linked Glycan Micro-heterogeneity Arabidopsis",134,29237727,,,,,,,,
VSVHDSANDSVVEDWVNTGGR,ng,N,101,true,"UDP-GlcNAc transporter glycopeptide analysis",135,30224661,,,,,,,4.3119988291852E-20,-0.1000000
GLLNISGDGKK,ng,N,137,false,"Conserved N-glycosylation",74,22633491,"MaxQuant Score",87.3340000,1.0000000,,,,0.0010000000474975,-0.4580000
GLLNISGDGKK,ng,N,137,false,"N-Glycopeptide Profiling in Arabidopsis Infloresce",132,27067053,"MOWSE score",23.1000000,,,,,0.035999998450279,
GLLNISGDGKK,ng,N,137,false,"N-linked Glycan Micro-heterogeneity Arabidopsis",134,29237727,,,,,,,,
GLLNISGDGKK,ng,N,137,false,"UDP-GlcNAc transporter glycopeptide analysis",135,30224661,,,,,,,0.00015370265464298,0.5000000
GLLNISGDGK,ng,N,137,false,"N-glycan occupancy Arabidopsis glycoproteins",87,23994444,"Ladder score",56.1000000,,,,,,
GLLNISGDGK,ng,N,137,false,"UDP-GlcNAc transporter glycopeptide analysis",135,30224661,,,,,,,2.1056405330455E-6,0.6000000
