Peptide,PTM,ModifiedAA,ModifiedPosition,PeptideUniqueToGene,ExperimentDesc,ExpID,PubmedID,ScoreType,IdentScore,LocProb,Log2FChange,PQ-val,QuantSig,PEP,MassErrorPPM
GVCCPFLQPWDR,acy,C,4,true,"Arabidopsis S-acylation atlas - Meristem",163a,35681017,,,,,,,,
GVCCPFLQPWDR,acy,C,4,true,"Arabidopsis S-acylation atlas - Leaf",163c,35681017,,,,,,,,
GVCCPFLQPWDR,acy,C,4,true,"Arabidopsis S-acylation atlas - Silique",163e,35681017,,,,,,,,
GVCCPFLQPWDR,acy,C,5,true,"Arabidopsis S-acylation atlas - Meristem",163a,35681017,,,,,,,,
GVCCPFLQPWDR,acy,C,5,true,"Arabidopsis S-acylation atlas - Leaf",163c,35681017,,,,,,,,
GVCCPFLQPWDR,acy,C,5,true,"Arabidopsis S-acylation atlas - Silique",163e,35681017,,,,,,,,
NPSTTSIQHASR,ph,S,112,true,"atm and atr DNA damage response",88,25561503,"MASCOT Score",43.0000000,1.0000000,,,,,-0.5300000
NPSTTSIQHASR,ph,S,112,true,"Tissue atlas Arabidopsis - ProteomicsDB",114,32188942,"MaxQuant score",85.4500000,0.9884430,,,,0.00062092597363517,
NPSTTSIQHASR,ph,T,113,true,"Tissue atlas Arabidopsis - ProteomicsDB",114,32188942,"MaxQuant score",80.7460000,0.7774900,,,,0.0034604999236763,
NPSTTSIQHASR,ph,S,115,true,"Tissue atlas Arabidopsis - ProteomicsDB",114,32188942,"MaxQuant score",121.1800000,0.7659970,,,,3.358679896337E-5,
SESVVVNVEGGSASCPR,acy,C,137,true,"Arabidopsis S-acylation atlas - Hypocotyl",163b,35681017,,,,,,,,
SESVVVNVEGGSASCPR,acy,C,137,true,"Arabidopsis S-acylation atlas - Leaf",163c,35681017,,,,,,,,
NLTCGYCHVEQPPR,acy,C,164,true,"Arabidopsis S-acylation atlas - Silique",163e,35681017,,,,,,,,
SRPYTCIDMLK,acy,C,331,true,"Arabidopsis S-acylation atlas - Meristem",163a,35681017,,,,,,,,
SRPYTCIDMLK,acy,C,331,true,"Arabidopsis S-acylation atlas - Silique",163e,35681017,,,,,,,,
