Peptide,PTM,ModifiedAA,ModifiedPosition,PeptideUniqueToGene,ExperimentDesc,ExpID,PubmedID,ScoreType,IdentScore,LocProb,Log2FChange,PQ-val,QuantSig,PEP,MassErrorPPM
ARYDRAITVFSPDGHLFQVE,nta,A,2,false,"Arabidopsis translation initiation landscape - NTA",167a,35069635,,,,,,,,
ARYDRAITVFSPD,nta,A,2,false,"HUNTER N-terminome: legumain, GluC and trypsin",119,31951383,"MaxQuant score",102.5200000,,,,,,
KGNAAVGVR,ub,K,29,false,"Arabidopsis ubiquitination COFRADIC",40,26744219,"MaxQuant Score",143.2800000,1.0000000,,,,2.6550000256975E-5,0.3140000
IVSLDNHIALACAGLK,so,C,74,false,"S-sulfenylation site detection using YAP1C",110,32714340,,,,,,,,
IECQSHR,sno,C,92,false,"hot5-4 / wildtype, FAT-switch S-nitrosoproteome",169,37277371,,,,-0.1912729,0.4038698,NO,,
IECQSHR,so,C,92,false,"Arabidopsis S-sulfenylation chemoproteomics",108,31578252,"pFind PSM Score",0.0783521,,1.1904800,,,,0.2144142
IECQSHR,so,C,92,false,"S-sulfenylation site detection using YAP1C",110,32714340,,,,,,,,
LEDPVTVE,nt,L,99,false,"Arg/N-end rule seed, prt6 vs. Wt",99,29168982,"MASCOT Score",40.2400000,,0.1091455,0.7986106,NO,0.040199998766184,0.9912691
IPALYQTDPSGTFSAWKANATGR,ub,K,159,true,"upl3 mutant / wildtype",168,35926874,"MaxQuant score",159.4700000,1.0000000,-0.5713216,0.5014400,NO,6.4193100102149E-26,0.1164600
EFLEKNYK,ac,K,176,false,"Quantitative Acetylproteomics",101,29440448,,,,,,,,
NYKESAGQETVK,ub,K,179,true,"Ubiquitination Membrane Proteins",120,33585938,,,,,,,,
NYKESAGQETVK,ub,K,179,true,"upl3 mutant / wildtype",168,35926874,"MaxQuant score",147.2400000,1.0000000,0.2078929,0.7731600,NO,4.5164399997688E-10,0.6130300
