Peptide,PTM,ModifiedAA,ModifiedPosition,PeptideUniqueToGene,ExperimentDesc,ExpID,PubmedID,ScoreType,IdentScore,LocProb,Log2FChange,PQ-val,QuantSig,PEP,MassErrorPPM
ASENNGSRSDSESITAPKADSTVVEPR,nta,A,2,true,"Arabidopsis translation initiation landscape - NTA",167a,35069635,,,,,,,,
ASENNGSRSDSESITAPK,ph,S,3,true,"Tissue atlas Arabidopsis - ProteomicsDB",114,32188942,"MaxQuant score",131.9800000,0.9995280,,,,1.1863800110227E-14,
ASENNGSRSDSESITAPK,ph,S,8,true,"atm and atr DNA damage response",88,25561503,"MASCOT Score",52.0000000,0.8750000,,,,,-0.6800000
SDSESITAPKADSTVVEPR,nt,S,10,true,"Arabidopsis translation initiation landscape - NT",167b,35069635,,,,,,,,
SDSESITAPK,ph,S,10,true,"STN8 phosphoproteome",38,21768351,"MASCOT Score",46.3700000,,,,,,-0.1859140
SDSESITAPK,ph,S,10,true,"Large-scale phosphorylation discovery",44,23111157,XCorr,2.3260000,,,,,,
SDSESITAPK,ph,S,10,true,"Tyrosine phosphorylation in Arabidopsis",59,18463617,"MASCOT Score",37.0000000,,,,,,-0.3592410
SDSESITAPK,ph,S,10,true,"Chloroplast kinase substrates",60,19376835,"MASCOT Score",41.6500000,,,,,,-0.0245478
SDSESITAPK,ph,S,10,true,"LAXIC - ABA stress",84a,23660473,XCorr,3.1600000,0.9990000,,,,0.0078714303672314,
SDSESITAPK,ph,S,10,true,"LAXIC - mannitol vs control",84b,23660473,XCorr,2.8600000,0.9990000,1.7729701,,NO,1.2700000297627E-5,
SDSESITAPK,ph,S,10,true,"SnRK2 protein kinase substrates",85,23776212,XCorr,3.3620384,0.9990000,,,,0.032628700137138,
SDSESITAPK,ph,S,10,true,"atm and atr DNA damage response",88,25561503,"MASCOT Score",40.0000000,1.0000000,,,,,-2.2400000
SDSESITAPK,ph,S,10,true,"Phospho cell culture sucrose/TOR",109,30833711,,,0.9863270,,,,,
SDSESITAPK,ph,S,10,true,"Col-0 callus - FC Col-0 vs. Col-0 Xray",111a,31410901,,36.7700000,,-0.5538058,0.0000000,NO,,-0.1271509
SDSESITAPK,ph,S,10,true,"Col-0 X-ray callus - FC Col-0 vs. Col-0 Xray",111b,31410901,,36.7700000,,-0.5538058,0.0000000,NO,,-0.1271509
SDSESITAPK,ph,S,10,true,"atm callus - FC atm vs. atm Xray",111c,31410901,,36.7700000,,-0.7077444,0.0000000,NO,,-0.1271509
SDSESITAPK,ph,S,10,true,"atm-3 X-ray callus - FC atm vs. atm Xray",111d,31410901,,36.7700000,,-0.7077444,0.0000000,NO,,-0.1271509
SDSESITAPK,ph,S,10,true,"Tissue atlas Arabidopsis - ProteomicsDB",114,32188942,"MaxQuant score",284.9800000,0.9985330,,,,0,
SDSESITAPK,ph,S,12,true,"Tissue atlas Arabidopsis - ProteomicsDB",114,32188942,"MaxQuant score",205.5200000,0.9999540,,,,1.6480400384963E-21,
SDSESITAPK,ph,S,14,true,"Tissue atlas Arabidopsis - ProteomicsDB",114,32188942,"MaxQuant score",162.6800000,0.9998940,,,,4.70938999797E-7,
SDSESITAPKADSTVVEPR,ub,K,19,true,"upl3 mutant / wildtype",168,35926874,"MaxQuant score",94.2810000,1.0000000,-0.0831412,0.8950200,NO,1.3664700304616E-7,0.0459090
ADSTVVEPR,nt,A,20,true,"Metacaspase9 substrates - 35S:MC9 / mc9",51b,23964026,"MASCOT Score",78.0000000,,1.2504011,,NO,,0.2866582
ADSTVVEPR,nt,A,20,true,"Metacaspase9 substrates - in vitro rMC9",51c,23964026,"MASCOT Score",54.0000000,,3.4132867,,NO,,0.0959206
ADSTVVEPR,ph,S,22,true,"Tissue atlas Arabidopsis - ProteomicsDB",114,32188942,"MaxQuant score",160.7700000,0.9855070,,,,0.00015289599832613,
SSNFNTQR,nt,S,62,false,"Arabidopsis translation initiation landscape - NT",167b,35069635,,,,,,,,
EAYGLFACNGILFNHESPR,ox,C,208,true,"SPEAR - 10 mM H2O2 / mock",138a,34619326,,,,-1.7519368,0.0300314,YES,,
YFRPAEVDNLQGDASKAK,ac,K,327,true,"Quantitative Acetylproteomics",101,29440448,,,,,,,,
EVLGWKPQVGFEKLVK,ub,K,342,true,"upl3 mutant / wildtype",168,35926874,"MaxQuant score",89.4660000,1.0000000,0.1763228,0.8104800,NO,1.5697700064266E-6,1.0257000
MMVDEDLELAKR,ub,K,356,false,"upl3 mutant / wildtype",168,35926874,"MaxQuant score",100.9300000,1.0000000,0.6266728,0.6142400,NO,6.6318003518973E-5,0.3464700
VLVDAGYMDAK,mox,M,367,true,"cat2 Methionine oxidation - 1h stress",62a,25693801,"MASCOT Score",95.0000000,,0.2221339,,NO,,
VLVDAGYMDAK,mox,M,367,true,"cat2 Methionine oxidation - 3h stress",62b,25693801,"MASCOT Score",54.0000000,,0.0510179,,NO,,
