Peptide,PTM,ModifiedAA,ModifiedPosition,PeptideUniqueToGene,ExperimentDesc,ExpID,PubmedID,ScoreType,IdentScore,LocProb,Log2FChange,PQ-val,QuantSig,PEP,MassErrorPPM
GDSGDPFLR,nt,G,2,true,"Arg/N-end rule seed, prt6 vs. Wt",99,29168982,"MASCOT Score",52.6900000,,,,,0.065909996628761,1.1676327
GDSGDPFLRNPNAAVQAR,nta,G,2,true,"Arg/N-end rule pathway Roots",80,25728785,"MASCOT Score",43.4000000,,,,,0.00021490000654012,
GDSGDPFLRNPNAAVQAR,nta,G,2,true,"Arabidopsis translation initiation landscape - NTA",167a,35069635,,,,,,,,
GDSGDPFLRNPN,nta,G,2,true,"HUNTER N-terminome: legumain, GluC and trypsin",119,31951383,"MaxQuant score",136.6300000,,,,,,
GDSGDPFLR,nta,G,2,true,"Arg/N-end rule seed, prt6 vs. Wt",99,29168982,"MASCOT Score",52.6900000,,,,,0.065909996628761,1.1676327
GDSGDPFLR,nta,G,2,true,"HUNTER N-terminome: legumain, GluC and trypsin",119,31951383,"MaxQuant score",110.1200000,,,,,,
LNYESSESKIKR,ub,K,153,true,"Arabidopsis ubiquitination COFRADIC",40,26744219,"MaxQuant Score",160.3800000,0.9850000,,,,1.7169969953526E-40,-0.2420000
LNYESSESKIKR,ub,K,155,true,"Arabidopsis ubiquitination COFRADIC",40,26744219,"MaxQuant Score",152.4700000,0.9880000,,,,3.5679999513949E-21,-0.3780000
EFESYGPIKR,ac,K,165,true,"Quantitative Acetylproteomics",101,29440448,,,,,,,,
EFESYGPIKR,ub,K,165,true,"Arabidopsis ubiquitination COFRADIC",40,26744219,"MaxQuant Score",71.4510000,1.0000000,,,,0.0010000000474975,-0.1890000
DMKAAYKQADGQKIDGR,ub,K,193,true,"Arabidopsis ubiquitination COFRADIC",40,26744219,"MaxQuant Score",42.6330000,0.7790000,,,,0.0070000002160668,-0.6090000
DMKAAYKQADGQKIDGR,ub,K,197,true,"Arabidopsis ubiquitination COFRADIC",40,26744219,"MaxQuant Score",61.9420000,0.9980000,,,,5.3050001724841E-7,0.0760000
DMKAAYKQADGQKIDGR,ub,K,203,true,"Arabidopsis ubiquitination COFRADIC",40,26744219,"MaxQuant Score",113.5400000,1.0000000,,,,7.024000035591E-19,0.4210000
VGGGEEIVGEQQPQGRTSQSEEPSRPREER,ph,S,255,true,"TOR Kinase and ABA Receptor",100,29290610,XCorr,2.3414512,0.8877000,,,,0.011339999735355,
TSQSEEPSRPREER,ph,S,255,true,"TOR Kinase and ABA Receptor",100,29290610,XCorr,2.5060289,0.9794000,,,,0.019249999895692,
TSQSEEPSRPR,ph,S,255,true,"STN8 phosphoproteome",38,21768351,"MASCOT Score",44.0300000,,,,,,-0.7045560
TSQSEEPSRPR,ph,S,255,true,"Chloroplast kinase substrates",60,19376835,"MASCOT Score",41.0100000,,,,,,0.2699110
TSQSEEPSRPR,ph,S,255,true,"atm and atr DNA damage response",88,25561503,"MASCOT Score",38.0000000,1.0000000,,,,,-0.4900000
TSQSEEPSRPR,ph,S,255,true,"Phospho cell culture sucrose/TOR",109,30833711,,,0.9999890,,,,,
TSQSEEPSRPR,ph,S,255,true,"Tissue atlas Arabidopsis - ProteomicsDB",114,32188942,"MaxQuant score",195.7200000,1.0000000,,,,3.0434700295944E-18,
TSQSEEPSRPREER,ph,S,259,true,"Tissue atlas Arabidopsis - ProteomicsDB",114,32188942,"MaxQuant score",102.4700000,0.9993470,,,,3.9431201003026E-5,
ERSRELSHEQPR,ph,S,278,true,"atm and atr DNA damage response",88,25561503,"MASCOT Score",24.0000000,1.0000000,,,,,-0.0800000
SRELSHEQPR,ph,S,278,true,"STN8 phosphoproteome",38,21768351,"MASCOT Score",43.0000000,,,,,,
SRELSHEQPR,ph,S,278,true,"atm and atr DNA damage response",88,25561503,"MASCOT Score",41.0000000,1.0000000,,,,,0.1400000
SRELSHEQPR,ph,S,278,true,"Tissue atlas Arabidopsis - ProteomicsDB",114,32188942,"MaxQuant score",119.6200000,1.0000000,,,,3.9973900129553E-5,
ERSRELSHEQPR,ph,S,282,true,"atm and atr DNA damage response",88,25561503,"MASCOT Score",24.0000000,1.0000000,,,,,-0.0800000
SRELSHEQPR,ph,S,282,true,"atm and atr DNA damage response",88,25561503,"MASCOT Score",41.0000000,1.0000000,,,,,0.1400000
SRELSHEQPR,ph,S,282,true,"Phospho cell culture sucrose/TOR",109,30833711,,,1.0000000,,,,,
SRELSHEQPR,ph,S,282,true,"Tissue atlas Arabidopsis - ProteomicsDB",114,32188942,"MaxQuant score",179.0900000,1.0000000,,,,1.5599800462951E-5,
ELSHEQPR,ph,S,282,true,"Ethylene-regulated phosphorylation ein2 mutant",30,19253305,"MASCOT Score",40.0000000,,,,,,-1.3633436
ELSHEQPR,ph,S,282,true,"Chloroplast kinase substrates",60,19376835,"MASCOT Score",50.2900000,,,,,,-0.3793740
ELSHEQPR,ph,S,282,true,"atm and atr DNA damage response",88,25561503,"MASCOT Score",44.0000000,1.0000000,,,,,-0.1200000
ERDYEGGEYEHEGGGRSR,ph,S,368,true,"srk2dei ABA signaling phopshoproteomics",83,23572148,"MASCOT Score",36.0000000,,,,,,-0.0005000
ERDYEGGEYEHEGGGRSR,ph,S,368,true,"TOR Kinase and ABA Receptor",100,29290610,XCorr,3.3978045,0.9996000,,,,0.013450000435114,
ERDYEGGEYEHEGGGRSR,ph,S,368,true,"Tissue atlas Arabidopsis - ProteomicsDB",114,32188942,"MaxQuant score",145.7100000,1.0000000,,,,2.2378200502512E-14,
DYEGGEYEHEGGGRSR,ph,S,368,true,"atm and atr DNA damage response",88,25561503,"MASCOT Score",64.0000000,1.0000000,,,,,-0.2600000
DYEGGEYEHEGGGRSR,ph,S,368,true,"Phospho cell culture sucrose/TOR",109,30833711,,,1.0000000,,,,,
YDKMEEDDFR,ub,K,402,true,"Arabidopsis ubiquitination COFRADIC",40,26744219,"MaxQuant Score",63.6240000,1.0000000,,,,0.00072840001666918,0.1000000
SESREYVR,ph,S,420,true,"Tissue atlas Arabidopsis - ProteomicsDB",114,32188942,"MaxQuant score",69.3460000,0.9999940,,,,0.012344799935818,
SESREYVR,ph,S,422,true,"Tissue atlas Arabidopsis - ProteomicsDB",114,32188942,"MaxQuant score",107.2100000,0.9999810,,,,0.0018241100478917,
