Peptide,PTM,ModifiedAA,ModifiedPosition,PeptideUniqueToGene,ExperimentDesc,ExpID,PubmedID,ScoreType,IdentScore,LocProb,Log2FChange,PQ-val,QuantSig,PEP,MassErrorPPM
MEWATVQHLDLR,nta,M,1,true,"Arg/N-end rule pathway Roots",80,25728785,"MASCOT Score",57.8500000,,,,,1.3830000170856E-5,
MEWATVQHLDLR,nta,M,1,true,"Tic56 chloroplast import - tic56-1",89c,25588737,XCorr,2.9030027,,,,,,
MEWATVQHLDLR,nta,M,1,true,"Arg/N-end rule seed, prt6 vs. Wt",99,29168982,"MASCOT Score",74.9800000,,,,,0.0035349999088794,-0.8948110
MEWATVQHLDLR,nta,M,1,true,"FtsH12 N-terminome: WT / FtsH12 knockdown miRNA",118,33216923,"MaxQuant score",171.6800000,,7.7731309,0.0000026,YES,0,
MEWATVQHLDLR,nta,M,1,true,"HUNTER N-terminome: legumain, GluC and trypsin",119,31951383,"MaxQuant score",85.8130000,,,,,,
LSSMGSSGILAEHQLQALLQEHK,ph,S,382,true,"Tissue atlas Arabidopsis - ProteomicsDB",114,32188942,"MaxQuant score",125.8300000,0.8248950,,,,3.014030016877E-22,
LSASDGHYISTQGEGR,ph,S,656,true,"atm and atr DNA damage response",88,25561503,"MASCOT Score",24.0000000,0.9910000,,,,,0.3600000
LSASDGHYISTQGEGR,ph,S,658,true,"Tissue atlas Arabidopsis - ProteomicsDB",114,32188942,"MaxQuant score",135.8900000,0.9997040,,,,4.7612900289096E-8,
FSTALSVLK,ph,S,890,true,"Lateral root-induction - NAA vs control",106,23328941,"MASCOT Score",22.0000000,,,,,,
PVSDKPLALPAGESSSMMGLESLGK,ph,S,1105,true,"Tissue atlas Arabidopsis - ProteomicsDB",114,32188942,"MaxQuant score",68.7080000,0.7571480,,,,8.1632799719955E-7,
TMYGATGDGSSSDEEGVTKPK,ph,T,1131,true,"LAXIC - ABA stress",84a,23660473,XCorr,3.4800000,0.7790000,,,,0.008773029781878,
TMYGATGDGSSSDEEGVTKPK,ph,T,1131,true,"Brassinosteroid-Regulated Phosphorylation Dynamics",94,26187819,"MaxQuant Score",66.3000000,0.7520000,,,,0.046000000089407,0.0660000
TMYGATGDGSSSDEEGVTKPK,ph,Y,1133,true,"LAXIC - ABA stress",84a,23660473,XCorr,3.4800000,0.8260000,,,,0.008773029781878,
TMYGATGDGSSSDEEGVTKPK,ph,Y,1133,true,"Brassinosteroid-Regulated Phosphorylation Dynamics",94,26187819,"MaxQuant Score",66.3000000,0.8530000,,,,0.046000000089407,1.6840000
TMYGATGDGSSSDEEGVTKPK,ph,T,1136,true,"Brassinosteroid-Regulated Phosphorylation Dynamics",94,26187819,"MaxQuant Score",66.3000000,0.8300000,,,,0.046000000089407,0.0660000
TMYGATGDGSSSDEEGVTKPK,ph,S,1140,true,"srk2dei ABA signaling phopshoproteomics",83,23572148,"MASCOT Score",53.0000000,,,,,,0.0005000
TMYGATGDGSSSDEEGVTKPK,ph,S,1140,true,"LAXIC - mannitol vs control",84b,23660473,XCorr,4.3600000,0.8400000,,,,0.0036338800564408,
TMYGATGDGSSSDEEGVTKPK,ph,S,1140,true,"SnRK2 protein kinase substrates",85,23776212,XCorr,5.0655527,0.9980000,,,,1.8408899959965E-9,
TMYGATGDGSSSDEEGVTKPK,ph,S,1140,true,"atm and atr DNA damage response",88,25561503,"MASCOT Score",26.0000000,1.0000000,,,,,0.5500000
TMYGATGDGSSSDEEGVTKPK,ph,S,1140,true,"Brassinosteroid-Regulated Phosphorylation Dynamics",94,26187819,"MaxQuant Score",134.8100000,1.0000000,,,,1.5670000266255E-6,2.0010000
TMYGATGDGSSSDEEGVTKPK,ph,S,1140,true,"TOR Kinase and ABA Receptor",100,29290610,XCorr,6.1528673,0.9985000,,,,3.0260000016824E-7,
TMYGATGDGSSSDEEGVTKPK,ph,S,1140,true,"Lateral root-induction - NAA vs control",106,23328941,"MASCOT Score",26.0000000,,,,,,
TMYGATGDGSSSDEEGVTKPK,ph,S,1140,true,"Tissue atlas Arabidopsis - ProteomicsDB",114,32188942,"MaxQuant score",181.9200000,0.9999930,,,,0,
TMYGATGDGSSSDEEGVTKPK,ph,S,1141,true,"srk2dei ABA signaling phopshoproteomics",83,23572148,"MASCOT Score",53.0000000,,,,,,0.0005000
TMYGATGDGSSSDEEGVTKPK,ph,S,1141,true,"LAXIC - mannitol vs control",84b,23660473,XCorr,4.3600000,0.8400000,,,,0.0036338800564408,
TMYGATGDGSSSDEEGVTKPK,ph,S,1141,true,"SnRK2 protein kinase substrates",85,23776212,XCorr,5.0655527,0.9580000,,,,1.8408899959965E-9,
TMYGATGDGSSSDEEGVTKPK,ph,S,1141,true,"atm and atr DNA damage response",88,25561503,"MASCOT Score",26.0000000,1.0000000,,,,,0.5500000
TMYGATGDGSSSDEEGVTKPK,ph,S,1141,true,"Brassinosteroid-Regulated Phosphorylation Dynamics",94,26187819,"MaxQuant Score",134.8100000,1.0000000,,,,1.5670000266255E-6,2.0010000
TMYGATGDGSSSDEEGVTKPK,ph,S,1141,true,"TOR Kinase and ABA Receptor",100,29290610,XCorr,6.1528673,0.9985000,,,,3.0260000016824E-7,
TMYGATGDGSSSDEEGVTKPK,ph,S,1141,true,"Lateral root-induction - NAA vs control",106,23328941,"MASCOT Score",26.0000000,,,,,,
TMYGATGDGSSSDEEGVTKPK,ph,S,1141,true,"Tissue atlas Arabidopsis - ProteomicsDB",114,32188942,"MaxQuant score",181.9200000,0.9999890,,,,0,
TMYGATGDGSSSDEEGVTKPK,ph,S,1142,true,"srk2dei ABA signaling phopshoproteomics",83,23572148,"MASCOT Score",53.0000000,,,,,,0.0005000
TMYGATGDGSSSDEEGVTKPK,ph,S,1142,true,"LAXIC - mannitol vs control",84b,23660473,XCorr,3.2600000,0.8500000,,,,0.0030491100624204,
TMYGATGDGSSSDEEGVTKPK,ph,S,1142,true,"SnRK2 protein kinase substrates",85,23776212,XCorr,4.4661832,0.8920000,,,,1.485589962158E-8,
TMYGATGDGSSSDEEGVTKPK,ph,S,1142,true,"atm and atr DNA damage response",88,25561503,"MASCOT Score",26.0000000,1.0000000,,,,,0.5500000
TMYGATGDGSSSDEEGVTKPK,ph,S,1142,true,"Brassinosteroid-Regulated Phosphorylation Dynamics",94,26187819,"MaxQuant Score",134.8100000,1.0000000,,,,1.5670000266255E-6,2.0010000
TMYGATGDGSSSDEEGVTKPK,ph,S,1142,true,"TOR Kinase and ABA Receptor",100,29290610,XCorr,6.1528673,0.9985000,,,,3.0260000016824E-7,
TMYGATGDGSSSDEEGVTKPK,ph,S,1142,true,"Lateral root-induction - NAA vs control",106,23328941,"MASCOT Score",26.0000000,,,,,,
TMYGATGDGSSSDEEGVTKPK,ph,S,1142,true,"Tissue atlas Arabidopsis - ProteomicsDB",114,32188942,"MaxQuant score",181.9200000,0.9999920,,,,0,
TMYGATGDGSSSDEEGVTKPK,ph,T,1148,true,"srk2dei ABA signaling phopshoproteomics",83,23572148,"MASCOT Score",25.0000000,,,,,,-0.0004000
EKPTSTTVDVNK,ph,T,1162,true,"atm and atr DNA damage response",88,25561503,"MASCOT Score",27.0000000,0.9360000,,,,,-1.4200000
EKPTSTTVDVNK,ph,S,1163,true,"Tissue atlas Arabidopsis - ProteomicsDB",114,32188942,"MaxQuant score",141.8800000,0.9762770,,,,5.8911100495607E-6,
LGDGLGLTMSR,og,T,1187,true,"O-GlcNac Inflorescence Tissue",81,28154133,"MASCOT Score",37.7000000,,,,,,0.3600000
LGDGLGLTMSR,ph,T,1187,true,"atm and atr DNA damage response",88,25561503,"MASCOT Score",49.0000000,1.0000000,,,,,-1.8800000
LGDGLGLTMSR,ph,T,1187,true,"TOR Kinase and ABA Receptor",100,29290610,XCorr,4.7157311,0.9937000,,,,1.8250000266562E-7,
LGDGLGLTMSR,ph,T,1187,true,"Tissue atlas Arabidopsis - ProteomicsDB",114,32188942,"MaxQuant score",167.7300000,0.9905580,,,,1.6783000336695E-11,
LGDGLGLTMSR,ph,S,1189,true,"Tissue atlas Arabidopsis - ProteomicsDB",114,32188942,"MaxQuant score",158.0200000,0.8120170,,,,1.5159899724448E-10,
VQGASALSAKDEMAR,ub,K,1473,true,"Arabidopsis ubiquitination COFRADIC",40,26744219,"MaxQuant Score",73.8340000,1.0000000,,,,2.2159999844007E-6,0.4820000
SIDPLEDPSQLCSATLSR,sno,C,1559,true,"hot5-4 / wildtype, FAT-switch S-nitrosoproteome",169,37277371,,,,,,,,
RSDALAGPAPVSTPFG,ph,T,1611,true,"Tissue atlas Arabidopsis - ProteomicsDB",114,32188942,"MaxQuant score",147.9600000,0.9976980,,,,3.4100398949022E-8,
