Peptide,PTM,ModifiedAA,ModifiedPosition,PeptideUniqueToGene,ExperimentDesc,ExpID,PubmedID,ScoreType,IdentScore,LocProb,Log2FChange,PQ-val,QuantSig,PEP,MassErrorPPM
GLCTSKPNSSNSDQTPAR,myr,G,2,true,"N-Terminal Myristoylated Proteins",102,29453228,,,,,,,,
NSPLPASESVKPSSSSVNGEDQCVTTTNNEGK,ph,S,21,true,"Tissue atlas Arabidopsis - ProteomicsDB",114,32188942,"MaxQuant score",175.3100000,1.0000000,,,,0,
NSPLPASESVKPSSSSVNGEDQCVTTTNNEGKK,ph,S,28,true,"Tissue atlas Arabidopsis - ProteomicsDB",114,32188942,"MaxQuant score",154.5000000,0.9673990,,,,0,
TPARSPATNSTNSTPK,ph,S,76,true,"Tissue atlas Arabidopsis - ProteomicsDB",114,32188942,"MaxQuant score",48.8990000,0.9564870,,,,0.0013119400246069,
SPATNSTNSTPKR,ph,S,81,true,"atm and atr DNA damage response",88,25561503,"MASCOT Score",24.0000000,0.9420000,,,,,-0.8600000
SPATNSTNSTPKR,ph,S,84,true,"atm and atr DNA damage response",88,25561503,"MASCOT Score",24.0000000,0.8880000,,,,,-0.8600000
SPATNSTNSTPKR,ph,T,85,true,"atm and atr DNA damage response",88,25561503,"MASCOT Score",30.0000000,1.0000000,,,,,-1.6300000
RPFPPPSPAK,ph,S,98,false,"Phosphoproteome ethylene-regulated time response",46,24043427,"MASCOT Score",32.1300000,,,,,,-5.9549000
RPFPPPSPAK,ph,S,98,false,"atm and atr DNA damage response",88,25561503,"MASCOT Score",40.0000000,1.0000000,,,,,-1.2500000
RPFPPPSPAK,ph,S,98,false,"Tissue atlas Arabidopsis - ProteomicsDB",114,32188942,"MaxQuant score",162.1300000,1.0000000,,,,3.824499970051E-7,
HGSVKPNSSAIPEGSEAEGGGVGLDK,ph,S,113,true,"Tissue atlas Arabidopsis - ProteomicsDB",114,32188942,"MaxQuant score",125.7700000,0.9862820,,,,5.8653098645609E-35,
RHGSVKPNSSAIPEGSEAEGGGVGLDK,ph,S,119,true,"TOR Kinase and ABA Receptor",100,29290610,XCorr,3.6966691,0.8087000,,,,7.0169997343328E-5,
LNDIVGSAYYVAPEVLHR,ph,S,316,false,"Tissue atlas Arabidopsis - ProteomicsDB",114,32188942,"MaxQuant score",54.9850000,0.9838700,,,,0.00049012998351827,
DIVGSAYYVAPEVLHR,ph,S,316,false,"Tissue atlas Arabidopsis - ProteomicsDB",114,32188942,"MaxQuant score",153.2400000,1.0000000,,,,7.4156701612704E-11,
TESGIFR,ph,S,358,false,"Arabidopsis root NAA phosphoproteome",18a,27643528,"MaxQuant Score",53.9680000,0.9990000,,,,0.0080000003799796,-0.8510000
TESGIFR,ph,S,358,false,"Phosphorylation Early Elicitor Signaling",23,17317660,,,,,,,,
TESGIFR,ph,S,358,false,"Plasmembrane Ph Immune Responses",25,17651370,,,,,,,,
TESGIFR,ph,S,358,false,"srk2dei ABA signaling phopshoproteomics",83,23572148,"MASCOT Score",47.0000000,,,,,,-0.0001000
TESGIFR,ph,S,358,false,"Phospho cell culture sucrose/TOR",109,30833711,,,0.9999660,,,,,
TESGIFR,ph,S,358,false,"Tissue atlas Arabidopsis - ProteomicsDB",114,32188942,"MaxQuant score",194.2900000,1.0000000,,,,6.5661898140945E-9,
