Peptide,PTM,ModifiedAA,ModifiedPosition,PeptideUniqueToGene,ExperimentDesc,ExpID,PubmedID,ScoreType,IdentScore,LocProb,Log2FChange,PQ-val,QuantSig,PEP,MassErrorPPM
ATDFKSLPVIDISR,nt,A,2,true,"N-terminal ChaFRADIC",92,26010716,"MASCOT Score",30.7400000,,,,,0.00028939999174327,
ATDFKSLPVIDISR,nt,A,2,true,"Arg/N-end rule seed, prt6 vs. Wt",99,29168982,"MASCOT Score",36.0300000,,,,,0.0043469998054206,-1.9933326
ATDFKSLPVI,nt,A,2,true,"N-term acetylation drought responses",5,26184543,,,,,,,,
ATDFKSLPVIDISRLL,nta,A,2,true,"Arabidopsis translation initiation landscape - NTA",167a,35069635,,,,,,,,
ATDFKSLPVIDISR,nta,A,2,true,"Arg/N-end rule pathway Roots",80,25728785,"MASCOT Score",50.2600000,,,,,2.6530000468483E-5,
ATDFKSLPVIDISR,nta,A,2,true,"N-terminal ChaFRADIC",92,26010716,"MASCOT Score",30.7400000,,,,,0.00028939999174327,
ATDFKSLPVIDISR,nta,A,2,true,"Arg/N-end rule seed, prt6 vs. Wt",99,29168982,"MASCOT Score",36.0300000,,-0.1144167,0.4055302,NO,0.0043469998054206,-1.9933326
ATDFKSLPVIDISR,nta,A,2,true,"HUNTER N-terminome: legumain, GluC and trypsin",119,31951383,"MaxQuant score",85.2880000,,,,,,
ATDFKSLPVI,nta,A,2,true,"N-term acetylation drought responses",5,26184543,,,,,,,,
GGCQVFK,sno,C,310,true,"hot5-4 / wildtype, FAT-switch S-nitrosoproteome",169,37277371,,,,0.0951403,0.3196264,NO,,
RAVYGEHLVSK,ph,S,324,true,"Tissue atlas Arabidopsis - ProteomicsDB",114,32188942,"MaxQuant score",61.5230000,0.9999980,,,,0.0061760097742081,
