Peptide,PTM,ModifiedAA,ModifiedPosition,PeptideUniqueToGene,ExperimentDesc,ExpID,PubmedID,ScoreType,IdentScore,LocProb,Log2FChange,PQ-val,QuantSig,PEP,MassErrorPPM
KAHFTASSSER,ub,K,16,true,"Arabidopsis ubiquitination COFRADIC",40,26744219,"MaxQuant Score",47.7120000,1.0000000,,,,0.003000000026077,0.2610000
AHFTASSSER,ph,S,23,true,"TOR Kinase and ABA Receptor",100,29290610,XCorr,2.5626051,0.8839000,,,,0.054949998855591,
VIMSSPLSTDLR,ph,S,35,true,"SIRK1 phosphorylation",86a,23820729,"MaxQuant Score",50.8710000,0.9550000,,,,1.4589999914169,11.1510000
VIMSSPLSTDLR,ph,T,36,true,"SIRK1 phosphorylation",86a,23820729,"MaxQuant Score",50.8710000,0.9550000,,,,1.4589999914169,11.1510000
SMPIRKDDEVQIVR,nt,S,46,true,"Arabidopsis translation initiation landscape - NT",167b,35069635,,,,,,,,
KDDEVQIVR,ub,K,51,true,"Arabidopsis ubiquitination COFRADIC",40,26744219,"MaxQuant Score",137.9800000,1.0000000,,,,2.5100000129896E-5,-0.0260000
EGKVVQVYR,ub,K,68,true,"Arabidopsis ubiquitination COFRADIC",40,26744219,"MaxQuant Score",106.4200000,1.0000000,,,,0,0.1520000
VVITKLR,ac,K,107,true,"Quantitative Acetylproteomics",101,29440448,,,,,,,,
AAADKEKGTKFTSEDVMQNVD,ub,K,135,true,"Arabidopsis ubiquitination COFRADIC",40,26744219,"MaxQuant Score",68.6390000,0.9970000,,,,4.57799996642E-14,0.0700000
GTKFTSEDVMQNVD,ph,S,138,true,"SnRK2 protein kinase substrates",85,23776212,XCorr,2.4389303,0.9620000,,,,0.013460599817336,
FTSEDVMQNVD,ph,S,138,true,"Large-scale phosphorylation discovery",44,23111157,XCorr,3.4410000,,,,,,
FTSEDVMQNVD,ph,S,138,true,"Tyrosine phosphorylation in Arabidopsis",59,18463617,"MASCOT Score",52.0000000,,,,,,-1.0267702
FTSEDVMQNVD,ph,S,138,true,"srk2dei ABA signaling phopshoproteomics",83,23572148,"MASCOT Score",60.0000000,,,,,,0.0014000
FTSEDVMQNVD,ph,S,138,true,"atm and atr DNA damage response",88,25561503,"MASCOT Score",36.0000000,0.9990000,,,,,0.1800000
FTSEDVMQNVD,ph,S,138,true,"TOR Kinase and ABA Receptor",100,29290610,XCorr,2.9179950,0.9489000,,,,0.0018189999973401,
FTSEDVMQNVD,ph,S,138,true,"Lateral root-induction - NAA vs control",106,23328941,"MASCOT Score",25.0000000,,,,,,
FTSEDVMQNVD,ph,S,138,true,"Phospho cell culture sucrose/TOR",109,30833711,,,0.8320680,,,,,
FTSEDVMQNVD,ph,S,138,true,"Tissue atlas Arabidopsis - ProteomicsDB",114,32188942,"MaxQuant score",189.3200000,0.9991860,,,,1.6797300451849E-23,
