Peptide,PTM,ModifiedAA,ModifiedPosition,PeptideUniqueToGene,ExperimentDesc,ExpID,PubmedID,ScoreType,IdentScore,LocProb,Log2FChange,PQ-val,QuantSig,PEP,MassErrorPPM
HLNLSNNVFNGSFPDELSSGLVNLR,ng,N,123,true,"Conserved N-glycosylation",74,22633491,"MaxQuant Score",240.3900000,0.8310000,,,,0,-0.1010000
HLNLSNNVFNGSFPDELSSGLVNLR,ng,N,130,true,"Conserved N-glycosylation",74,22633491,"MaxQuant Score",240.3900000,1.0000000,,,,0,-0.1010000
IPPEIGNLTTLR,ng,N,212,false,"Conserved N-glycosylation",74,22633491,"MaxQuant Score",140.6400000,1.0000000,,,,2.9120000003989E-14,0.0550000
IPPEIGNLTTLR,ng,N,212,false,"N-linked Glycan Micro-heterogeneity Arabidopsis",134,29237727,,,,,,,,
IPPEIGNLTTLR,ng,N,212,false,"UDP-GlcNAc transporter glycopeptide analysis",135,30224661,,,,,,,7.9889211690443E-8,0.4000000
MGENFLNGSIPK,ng,N,420,false,"Conserved N-glycosylation",74,22633491,"MaxQuant Score",153.2200000,0.9980000,,,,3.9330001318986E-15,-1.0460000
MGENFLNGSIPKELFGLPK,ph,S,422,true,"Phosphorylation in N starvation",63,22060019,"MASCOT Score",21.0000000,,,,,,-4.9263600
ILNYLNLSR,ng,N,558,false,"Conserved N-glycosylation",74,22633491,"MaxQuant Score",147.0500000,0.9950000,,,,9.9460003184504E-6,-0.1560000
ILNYLNLSR,ng,N,558,false,"UDP-GlcNAc transporter glycopeptide analysis",135,30224661,,,,,,,1.7744801880326E-5,0.3000000
GDLVAVKR,ac,K,718,false,"Quantitative Acetylproteomics",101,29440448,,,,,,,,
GSSHDHGFNAEIQTLGR,ph,S,727,false,"atm and atr DNA damage response",88,25561503,"MASCOT Score",56.0000000,0.9340000,,,,,-0.7800000
KGGHLHWNTR,ub,K,781,true,"Ubiquitination Membrane Proteins",120,33585938,,,,,,,,
SMTDSNKDCVLKVIDLR,ub,K,919,true,"Ubiquitination Membrane Proteins",120,33585938,,,,,,,,
APAINESSPDSGSPPDLLSN,ph,S,990,true,"atm and atr DNA damage response",88,25561503,"MASCOT Score",50.0000000,0.9930000,,,,,0.1400000
APAINESSPDSGSPPDLLSN,ph,S,995,true,"atm and atr DNA damage response",88,25561503,"MASCOT Score",50.0000000,0.9990000,,,,,0.1400000
