Peptide,PTM,ModifiedAA,ModifiedPosition,PeptideUniqueToGene,ExperimentDesc,ExpID,PubmedID,ScoreType,IdentScore,LocProb,Log2FChange,PQ-val,QuantSig,PEP,MassErrorPPM
MDFPENLPSDIGR,nta,M,1,true,"HUNTER N-terminome: legumain, GluC and trypsin",119,31951383,"MaxQuant score",81.8650000,,,,,,
ERLSGLNVR,ph,S,48,true,"Tissue atlas Arabidopsis - ProteomicsDB",114,32188942,"MaxQuant score",87.5730000,1.0000000,,,,0.0051276101730764,
IITDYVGSPATDPMR,ph,S,248,true,"Arabidopsis root NAA phosphoproteome",18a,27643528,"MaxQuant Score",67.6450000,0.8820000,,,,1.5480000001844E-5,0.6520000
IITDYVGSPATDPMR,ph,S,248,true,"STN8 phosphoproteome",38,21768351,"MASCOT Score",88.9600000,,,,,,
IITDYVGSPATDPMR,ph,S,248,true,"MAPK Arabidopsis substrates",45,23172892,"MaxQuant Score",122.3300000,,,,,,
IITDYVGSPATDPMR,ph,S,248,true,"Chloroplast kinase substrates",60,19376835,"MASCOT Score",69.0500000,,,,,,-0.5588630
IITDYVGSPATDPMR,ph,S,248,true,"srk2dei ABA signaling phopshoproteomics",83,23572148,"MASCOT Score",79.0000000,,,,,,-0.0006000
IITDYVGSPATDPMR,ph,S,248,true,"LAXIC - ABA stress",84a,23660473,XCorr,3.0700000,0.9990000,,,,0.00079921702854335,
IITDYVGSPATDPMR,ph,S,248,true,"SnRK2 protein kinase substrates",85,23776212,XCorr,3.9186544,1.0000000,,,,3.96250006599E-16,
IITDYVGSPATDPMR,ph,S,248,true,"atm and atr DNA damage response",88,25561503,"MASCOT Score",66.0000000,1.0000000,,,,,0.0000000
IITDYVGSPATDPMR,ph,S,248,true,"TOR Kinase and ABA Receptor",100,29290610,XCorr,4.8438501,0.9999000,,,,8.0969999771696E-7,
IITDYVGSPATDPMR,ph,S,248,true,"Lateral root-induction - NAA vs control",106,23328941,"MASCOT Score",52.0000000,,,,,,
IITDYVGSPATDPMR,ph,S,248,true,"Phospho cell culture sucrose/TOR",109,30833711,,,0.9999940,,,,,
IITDYVGSPATDPMR,ph,S,248,true,"Col-0 callus - FC Col-0 vs. Col-0 Xray",111a,31410901,,76.8000000,,0.7632897,0.0000000,NO,,-0.0259733
IITDYVGSPATDPMR,ph,S,248,true,"Col-0 X-ray callus - FC Col-0 vs. Col-0 Xray",111b,31410901,,76.8000000,,0.7632897,0.0000000,NO,,-0.0259733
IITDYVGSPATDPMR,ph,S,248,true,"atm callus - FC atm vs. atm Xray",111c,31410901,,76.8000000,,1.2400846,0.0000000,NO,,-0.0259733
IITDYVGSPATDPMR,ph,S,248,true,"atm-3 X-ray callus - FC atm vs. atm Xray",111d,31410901,,76.8000000,,1.2400846,0.0000000,NO,,-0.0259733
IITDYVGSPATDPMR,ph,S,248,true,"Tissue atlas Arabidopsis - ProteomicsDB",114,32188942,"MaxQuant score",281.1400000,0.9999560,,,,0,
IITDYVGSPATDPMR,ph,S,248,true,"Touch-induced phosphorylation: 40s touch vs untouc",136,30291188,"MASCOT score",81.9800000,,0.0841009,0.7332244,NO,,1.5202429
IITDYVGSPATDPMR,ph,T,251,true,"srk2dei ABA signaling phopshoproteomics",83,23572148,"MASCOT Score",65.0000000,,,,,,-0.0011000
IITDYVGSPATDPMR,ph,T,251,true,"SnRK2 protein kinase substrates",85,23776212,XCorr,3.9186544,1.0000000,,,,3.96250006599E-16,
IITDYVGSPATDPMR,ph,T,251,true,"atm and atr DNA damage response",88,25561503,"MASCOT Score",66.0000000,1.0000000,,,,,0.0000000
IITDYVGSPATDPMR,ph,T,251,true,"TOR Kinase and ABA Receptor",100,29290610,XCorr,3.6803319,0.9999000,,,,0.0014840000076219,
IITDYVGSPATDPMR,ph,T,251,true,"Lateral root-induction - NAA vs control",106,23328941,"MASCOT Score",30.0000000,,,,,,
IITDYVGSPATDPMR,ph,T,251,true,"Tissue atlas Arabidopsis - ProteomicsDB",114,32188942,"MaxQuant score",91.4010000,0.9998370,,,,0.0001118169966503,
FFPSPGRSVEGHSFTGR,ph,S,259,true,"SnRK2 protein kinase substrates",85,23776212,XCorr,2.4472327,0.9890000,,,,0.00068383297184482,
FFPSPGRSVEGHSFTGR,ph,S,259,true,"Brassinosteroid-Regulated Phosphorylation Dynamics",94,26187819,"MaxQuant Score",88.0750000,1.0000000,,,,0.0099999997764826,-1.0320000
FFPSPGR,ph,S,259,true,"Tissue atlas Arabidopsis - ProteomicsDB",114,32188942,"MaxQuant score",103.8700000,1.0000000,,,,0.00030029000481591,
FFPSPGRSVEGHSFTGR,ph,S,263,true,"SnRK2 protein kinase substrates",85,23776212,XCorr,2.4472327,0.9700000,,,,0.00068383297184482,
SVEGHSFTGR,ph,S,263,true,"atm and atr DNA damage response",88,25561503,"MASCOT Score",35.0000000,1.0000000,,,,,0.0800000
SVEGHSFTGR,ph,S,263,true,"Tissue atlas Arabidopsis - ProteomicsDB",114,32188942,"MaxQuant score",163.8300000,1.0000000,,,,4.0319301319869E-7,
FFPSPGRSVEGHSFTGR,ph,S,268,true,"Brassinosteroid-Regulated Phosphorylation Dynamics",94,26187819,"MaxQuant Score",88.0750000,0.9570000,,,,0.0099999997764826,-0.7260000
SVEGHSFTGR,ph,S,268,true,"atm and atr DNA damage response",88,25561503,"MASCOT Score",43.0000000,0.9940000,,,,,0.1800000
SVEGHSFTGR,ph,S,268,true,"Lateral root-induction - NAA vs control",106,23328941,"MASCOT Score",43.0000000,,,,,,
SVEGHSFTGR,ph,S,268,true,"Phospho cell culture sucrose/TOR",109,30833711,,,0.9805270,,,,,
SVEGHSFTGR,ph,S,268,true,"Col-0 callus - FC Col-0 vs. Col-0 Xray",111a,31410901,,33.2600000,,-0.7651495,0.0000000,NO,,0.1205046
SVEGHSFTGR,ph,S,268,true,"Col-0 X-ray callus - FC Col-0 vs. Col-0 Xray",111b,31410901,,33.2600000,,-0.7651495,0.0000000,NO,,0.1205046
SVEGHSFTGR,ph,S,268,true,"atm callus - FC atm vs. atm Xray",111c,31410901,,33.2600000,,-0.9010021,0.0000000,NO,,0.1205046
SVEGHSFTGR,ph,S,268,true,"atm-3 X-ray callus - FC atm vs. atm Xray",111d,31410901,,33.2600000,,-0.9010021,0.0000000,NO,,0.1205046
SVEGHSFTGR,ph,S,268,true,"Tissue atlas Arabidopsis - ProteomicsDB",114,32188942,"MaxQuant score",145.8100000,0.9967100,,,,6.9712399408672E-7,
FFPSPGRSVEGHSFTGR,ph,T,270,true,"Brassinosteroid-Regulated Phosphorylation Dynamics",94,26187819,"MaxQuant Score",82.2670000,0.8700000,,,,0.010999999940395,0.3390000
SVEGHSFTGR,ph,T,270,true,"TOR Kinase and ABA Receptor",100,29290610,XCorr,3.3276925,0.9249000,,,,0.00029739999445155,
TDAFGDNHQLSPPFSPSGSPSTPR,ph,S,337,true,"Phospho cell culture sucrose/TOR",109,30833711,,,0.9613310,,,,,
TDAFGDNHQLSPPFSPSGSPSTPR,ph,S,337,true,"Tissue atlas Arabidopsis - ProteomicsDB",114,32188942,"MaxQuant score",171.9900000,0.9999780,,,,0,
TDAFGDNHQLSPPFSPSGSPSTPR,ph,S,341,true,"Tissue atlas Arabidopsis - ProteomicsDB",114,32188942,"MaxQuant score",103.8500000,0.9763100,,,,1.6476799880368E-16,
YISGGNSPR,ph,S,353,true,"atm and atr DNA damage response",88,25561503,"MASCOT Score",41.0000000,1.0000000,,,,,0.0400000
YISGGNSPR,ph,S,353,true,"Tissue atlas Arabidopsis - ProteomicsDB",114,32188942,"MaxQuant score",88.4200000,0.9998900,,,,0.0021325501147658,
YISGGNSPR,ph,S,357,true,"STN8 phosphoproteome",38,21768351,"MASCOT Score",53.6800000,,,,,,0.3981000
YISGGNSPR,ph,S,357,true,"Large-scale phosphorylation discovery",44,23111157,XCorr,2.7060000,,,,,,
YISGGNSPR,ph,S,357,true,"atm and atr DNA damage response",88,25561503,"MASCOT Score",42.0000000,1.0000000,,,,,-0.1400000
YISGGNSPR,ph,S,357,true,"Tissue atlas Arabidopsis - ProteomicsDB",114,32188942,"MaxQuant score",119.7400000,1.0000000,,,,0.00029481199453585,
INVRPGTAPVTIPSSATLNR,ph,T,366,true,"TOR Kinase and ABA Receptor",100,29290610,XCorr,3.2260227,0.9638000,,,,0.001810000045225,
INVRPGTAPVTIPSSATLNR,ph,T,366,true,"Tissue atlas Arabidopsis - ProteomicsDB",114,32188942,"MaxQuant score",139.4700000,0.9999850,,,,4.8840698524383E-22,
INVRPGTAPVTIPSSATLNR,ph,S,374,true,"Tissue atlas Arabidopsis - ProteomicsDB",114,32188942,"MaxQuant score",91.1000000,0.8082570,,,,2.6038001124107E-6,
INVRPGTAPVTIPSSATLNR,ph,T,376,true,"Tissue atlas Arabidopsis - ProteomicsDB",114,32188942,"MaxQuant score",83.9340000,0.9109680,,,,2.5459999051236E-6,
YVSSNFSEPGR,ph,S,382,true,"atm and atr DNA damage response",88,25561503,"MASCOT Score",52.0000000,0.9380000,,,,,-0.0100000
YVSSNFSEPGR,ph,S,382,true,"Tissue atlas Arabidopsis - ProteomicsDB",114,32188942,"MaxQuant score",208.0800000,0.9997990,,,,1.1819700158153E-24,
YVSSNFSEPGR,ph,S,383,true,"atm and atr DNA damage response",88,25561503,"MASCOT Score",35.0000000,0.9360000,,,,,-0.5000000
YVSSNFSEPGR,ph,S,386,true,"atm and atr DNA damage response",88,25561503,"MASCOT Score",35.0000000,1.0000000,,,,,-0.5000000
YVSSNFSEPGR,ph,S,386,true,"Lateral root-induction - NAA vs control",106,23328941,"MASCOT Score",28.0000000,,,,,,
YVSSNFSEPGR,ph,S,386,true,"Tissue atlas Arabidopsis - ProteomicsDB",114,32188942,"MaxQuant score",183.1000000,0.9999900,,,,7.9874012466515E-44,
YVSSNFSEPGRNPLPPFSPK,ph,S,397,true,"STN8 phosphoproteome",38,21768351,"MASCOT Score",48.2800000,,,,,,-0.3474730
YVSSNFSEPGRNPLPPFSPK,ph,S,397,true,"Chloroplast kinase substrates",60,19376835,"MASCOT Score",44.0600000,,,,,,-0.3474730
YVSSNFSEPGRNPLPPFSPK,ph,S,397,true,"TOR Kinase and ABA Receptor",100,29290610,XCorr,4.1074486,0.9983000,,,,0.037099998444319,
YVSSNFSEPGRNPLPPFSPK,ph,S,397,true,"Tissue atlas Arabidopsis - ProteomicsDB",114,32188942,"MaxQuant score",254.3600000,1.0000000,,,,0,
NPLPPFSPK,ph,S,397,true,"atm and atr DNA damage response",88,25561503,"MASCOT Score",45.0000000,1.0000000,,,,,-0.2300000
NPLPPFSPK,ph,S,397,true,"Lateral root-induction - NAA vs control",106,23328941,"MASCOT Score",24.0000000,,,,,,
NPLPPFSPK,ph,S,397,true,"Phospho cell culture sucrose/TOR",109,30833711,,,1.0000000,,,,,
STRRSPSSQDSLPGIALYR,ph,S,404,true,"SnRK2 protein kinase substrates",85,23776212,XCorr,3.6850362,0.7790000,,,,3.96250006599E-16,
STRRSPSSQDSLPGIALYR,ph,S,404,true,"Brassinosteroid-Regulated Phosphorylation Dynamics",94,26187819,"MaxQuant Score",94.7070000,0.8300000,,,,0.003000000026077,-0.9800000
STRRSPSSQDSLPGIALYR,ph,S,404,true,"TOR Kinase and ABA Receptor",100,29290610,XCorr,4.0332150,0.9920000,,,,5.5479998991359E-5,
RSPSSQDSLPGIALYR,ph,S,404,true,"atm and atr DNA damage response",88,25561503,"MASCOT Score",70.0000000,0.9560000,,,,,-0.3400000
RSPSSQDSLPGIALYR,ph,S,404,true,"TOR Kinase and ABA Receptor",100,29290610,XCorr,3.0997250,0.9749000,,,,0.029859999194741,
RSPSSQDSLPGIALYR,ph,S,404,true,"Phospho cell culture sucrose/TOR",109,30833711,,,0.9979530,,,,,
RSPSSQDSLPGIALYR,ph,S,404,true,"Col-0 callus - FC Col-0 vs. Col-0 Xray",111a,31410901,,32.8000000,,1.1672933,0.0000000,NO,,0.5315726
RSPSSQDSLPGIALYR,ph,S,404,true,"Col-0 X-ray callus - FC Col-0 vs. Col-0 Xray",111b,31410901,,32.8000000,,1.1672933,0.0000000,NO,,0.5315726
RSPSSQDSLPGIALYR,ph,S,404,true,"atm callus - FC atm vs. atm Xray",111c,31410901,,32.8000000,,1.6388450,0.0000000,NO,,0.5315726
RSPSSQDSLPGIALYR,ph,S,404,true,"atm-3 X-ray callus - FC atm vs. atm Xray",111d,31410901,,32.8000000,,1.6388450,0.0000000,NO,,0.5315726
RSPSSQDSLPGIALYR,ph,S,404,true,"Tissue atlas Arabidopsis - ProteomicsDB",114,32188942,"MaxQuant score",267.5000000,0.9998060,,,,0,
SPSSQDSLPGIALYR,ph,S,404,true,"srk2dei ABA signaling phopshoproteomics",83,23572148,"MASCOT Score",51.0000000,,,,,,0.0008000
SPSSQDSLPGIALYR,ph,S,404,true,"atm and atr DNA damage response",88,25561503,"MASCOT Score",84.0000000,1.0000000,,,,,0.0700000
STRRSPSSQDSLPGIALYR,ph,S,406,true,"Conserved plant phosphoproteome - Arabidopsis",61a,20466843,"MASCOT Score",46.0000000,1.0000000,,,,,
STRRSPSSQDSLPGIALYR,ph,S,406,true,"srk2dei ABA signaling phopshoproteomics",83,23572148,"MASCOT Score",24.0000000,,,,,,0.0017000
STRRSPSSQDSLPGIALYR,ph,S,406,true,"Brassinosteroid-Regulated Phosphorylation Dynamics",94,26187819,"MaxQuant Score",94.7070000,0.7950000,,,,0.003000000026077,0.3520000
RSPSSQDSLPGIALYR,ph,S,406,true,"Phospho cell culture sucrose/TOR",109,30833711,,,0.7912150,,,,,
SPSSQDSLPGIALYR,ph,S,406,true,"Tyrosine phosphorylation in Arabidopsis",59,18463617,"MASCOT Score",62.0000000,,,,,,-0.5389963
SPSSQDSLPGIALYR,ph,S,406,true,"Conserved plant phosphoproteome - Arabidopsis",61a,20466843,"MASCOT Score",24.0000000,1.0000000,,,,,
SPSSQDSLPGIALYR,ph,S,406,true,"srk2dei ABA signaling phopshoproteomics",83,23572148,"MASCOT Score",81.0000000,,,,,,0.0010000
SPSSQDSLPGIALYR,ph,S,406,true,"TOR Kinase and ABA Receptor",100,29290610,XCorr,3.9646759,0.8302000,,,,3.1669999316364E-6,
SPSSQDSLPGIALYR,ph,S,406,true,"Tissue atlas Arabidopsis - ProteomicsDB",114,32188942,"MaxQuant score",265.1600000,0.9805140,,,,0,
STRRSPSSQDSLPGIALYR,ph,S,407,true,"Conserved plant phosphoproteome - Arabidopsis",61a,20466843,"MASCOT Score",46.0000000,1.0000000,,,,,
STRRSPSSQDSLPGIALYR,ph,S,407,true,"srk2dei ABA signaling phopshoproteomics",83,23572148,"MASCOT Score",24.0000000,,,,,,0.0017000
STRRSPSSQDSLPGIALYR,ph,S,407,true,"SnRK2 protein kinase substrates",85,23776212,XCorr,3.6850362,0.8360000,,,,3.96250006599E-16,
STRRSPSSQDSLPGIALYR,ph,S,407,true,"Brassinosteroid-Regulated Phosphorylation Dynamics",94,26187819,"MaxQuant Score",94.7070000,0.9880000,,,,0.003000000026077,0.3520000
STRRSPSSQDSLPGIALYR,ph,S,407,true,"TOR Kinase and ABA Receptor",100,29290610,XCorr,3.1113455,0.8128000,,,,0.01587999984622,
RSPSSQDSLPGIALYR,ph,S,407,true,"Tissue atlas Arabidopsis - ProteomicsDB",114,32188942,"MaxQuant score",212.7200000,0.9943940,,,,0,
SPSSQDSLPGIALYR,ph,S,407,true,"Conserved plant phosphoproteome - Arabidopsis",61a,20466843,"MASCOT Score",24.0000000,1.0000000,,,,,
SPSSQDSLPGIALYR,ph,S,407,true,"srk2dei ABA signaling phopshoproteomics",83,23572148,"MASCOT Score",35.0000000,,,,,,0.0017000
SPSSQDSLPGIALYR,ph,S,407,true,"SnRK2 protein kinase substrates",85,23776212,XCorr,2.3295021,0.8760000,,,,1.6472000424983E-5,
SPSSQDSLPGIALYR,ph,S,407,true,"Phospho cell culture sucrose/TOR",109,30833711,,,0.9940540,,,,,
STRRSPSSQDSLPGIALYR,ph,S,410,true,"Conserved plant phosphoproteome - Arabidopsis",61a,20466843,"MASCOT Score",46.0000000,1.0000000,,,,,
STRRSPSSQDSLPGIALYR,ph,S,410,true,"SnRK2 protein kinase substrates",85,23776212,XCorr,3.6850362,0.9820000,,,,3.96250006599E-16,
RSPSSQDSLPGIALYR,ph,S,410,true,"atm and atr DNA damage response",88,25561503,"MASCOT Score",20.0000000,0.9910000,,,,,0.2300000
RSPSSQDSLPGIALYR,ph,S,410,true,"Tissue atlas Arabidopsis - ProteomicsDB",114,32188942,"MaxQuant score",139.0000000,1.0000000,,,,9.1133597379667E-7,
SPSSQDSLPGIALYR,ph,S,410,true,"srk2dei ABA signaling phopshoproteomics",83,23572148,"MASCOT Score",23.0000000,,,,,,-0.0004000
SGESPSGLMNQYPTQK,ph,S,422,true,"srk2dei ABA signaling phopshoproteomics",83,23572148,"MASCOT Score",35.0000000,,,,,,0.0044000
SGESPSGLMNQYPTQK,ph,S,422,true,"atm and atr DNA damage response",88,25561503,"MASCOT Score",44.0000000,0.9980000,,,,,1.0500000
SGESPSGLMNQYPTQK,ph,S,422,true,"TOR Kinase and ABA Receptor",100,29290610,XCorr,4.6610608,0.9922000,,,,2.0019999283249E-5,
SGESPSGLMNQYPTQK,ph,S,422,true,"Lateral root-induction - NAA vs control",106,23328941,"MASCOT Score",22.0000000,,,,,,
SGESPSGLMNQYPTQK,ph,S,422,true,"Phospho cell culture sucrose/TOR",109,30833711,,,0.9984220,,,,,
SGESPSGLMNQYPTQK,ph,S,422,true,"Tissue atlas Arabidopsis - ProteomicsDB",114,32188942,"MaxQuant score",285.6200000,0.9999800,,,,0,
SGESPSGLMNQYPTQK,ph,S,425,true,"srk2dei ABA signaling phopshoproteomics",83,23572148,"MASCOT Score",38.0000000,,,,,,0.0000000
SGESPSGLMNQYPTQK,ph,S,425,true,"SnRK2 protein kinase substrates",85,23776212,XCorr,3.5497558,0.9370000,,,,4.829189936828E-9,
SGESPSGLMNQYPTQK,ph,S,425,true,"atm and atr DNA damage response",88,25561503,"MASCOT Score",42.0000000,0.9950000,,,,,0.2300000
SGESPSGLMNQYPTQK,ph,S,425,true,"Lateral root-induction - NAA vs control",106,23328941,"MASCOT Score",26.0000000,,,,,,
SGESPSGLMNQYPTQK,ph,S,425,true,"Tissue atlas Arabidopsis - ProteomicsDB",114,32188942,"MaxQuant score",375.4900000,0.9999990,,,,0,
YDSGRFSGVLSSSDSPR,ph,S,446,true,"atm and atr DNA damage response",88,25561503,"MASCOT Score",54.0000000,1.0000000,,,,,0.2200000
YDSGRFSGVLSSSDSPR,ph,S,446,true,"Tissue atlas Arabidopsis - ProteomicsDB",114,32188942,"MaxQuant score",121.7700000,0.9853080,,,,3.5545599796905E-9,
YDSGRFSGVLSSSDSPR,ph,S,450,true,"TOR Kinase and ABA Receptor",100,29290610,XCorr,3.1171815,0.8538000,,,,0.00029699999140576,
FSGVLSSSDSPR,ph,S,450,true,"Tissue atlas Arabidopsis - ProteomicsDB",114,32188942,"MaxQuant score",72.1450000,0.8046540,,,,0.00012391500058584,
FSGVLSSSDSPR,ph,S,454,true,"atm and atr DNA damage response",88,25561503,"MASCOT Score",49.0000000,0.9930000,,,,,-0.1700000
FSGVLSSSDSPR,ph,S,454,true,"Lateral root-induction - NAA vs control",106,23328941,"MASCOT Score",29.0000000,,,,,,
FSGVLSSSDSPR,ph,S,454,true,"Tissue atlas Arabidopsis - ProteomicsDB",114,32188942,"MaxQuant score",153.5100000,0.9444840,,,,7.6061802189997E-8,
FSGVLSSSDSPR,ph,S,455,true,"Lateral root-induction - NAA vs control",106,23328941,"MASCOT Score",45.0000000,,,,,,
FSGVLSSSDSPR,ph,S,455,true,"Tissue atlas Arabidopsis - ProteomicsDB",114,32188942,"MaxQuant score",203.2900000,0.9565590,,,,1.076860030438E-30,
FSGVLSSSDSPR,ph,S,456,true,"LAXIC - mannitol vs control",84b,23660473,XCorr,2.5600000,0.8310000,,,,0.0096770403906703,
FSGVLSSSDSPR,ph,S,456,true,"atm and atr DNA damage response",88,25561503,"MASCOT Score",50.0000000,0.9860000,,,,,0.5400000
FSGVLSSSDSPR,ph,S,456,true,"Tissue atlas Arabidopsis - ProteomicsDB",114,32188942,"MaxQuant score",155.4300000,0.7563110,,,,1.1259200238811E-9,
FSGVLSSSDSPR,ph,S,458,true,"srk2dei ABA signaling phopshoproteomics",83,23572148,"MASCOT Score",58.0000000,,,,,,0.0000000
FSGVLSSSDSPR,ph,S,458,true,"SnRK2 protein kinase substrates",85,23776212,XCorr,2.3007083,0.9960000,,,,1.8134100173484E-5,
FSGVLSSSDSPR,ph,S,458,true,"atm and atr DNA damage response",88,25561503,"MASCOT Score",59.0000000,0.9290000,,,,,0.3300000
FSGVLSSSDSPR,ph,S,458,true,"TOR Kinase and ABA Receptor",100,29290610,XCorr,3.3625965,0.9913000,,,,0.00046340000699274,
FSGVLSSSDSPR,ph,S,458,true,"Lateral root-induction - NAA vs control",106,23328941,"MASCOT Score",36.0000000,,,,,,
FSGVLSSSDSPR,ph,S,458,true,"Phospho cell culture sucrose/TOR",109,30833711,,,0.8388990,,,,,
FSGVLSSSDSPR,ph,S,458,true,"Col-0 callus - FC Col-0 vs. Col-0 Xray",111a,31410901,,76.2200000,,0.1766733,0.0000000,NO,,0.4529340
FSGVLSSSDSPR,ph,S,458,true,"Col-0 X-ray callus - FC Col-0 vs. Col-0 Xray",111b,31410901,,76.2200000,,0.1766733,0.0000000,NO,,0.4529340
FSGVLSSSDSPR,ph,S,458,true,"atm callus - FC atm vs. atm Xray",111c,31410901,,76.2200000,,0.3479957,0.0000000,NO,,0.4529340
FSGVLSSSDSPR,ph,S,458,true,"atm-3 X-ray callus - FC atm vs. atm Xray",111d,31410901,,76.2200000,,0.3479957,0.0000000,NO,,0.4529340
FSGVLSSSDSPR,ph,S,458,true,"Tissue atlas Arabidopsis - ProteomicsDB",114,32188942,"MaxQuant score",217.2000000,0.9923330,,,,5.1937894437551E-39,
FAFSRSPSR,ph,S,464,true,"Tissue atlas Arabidopsis - ProteomicsDB",114,32188942,"MaxQuant score",75.4160000,0.9904270,,,,0.0016556800110266,
FAFSRSPSR,ph,S,466,true,"srk2dei ABA signaling phopshoproteomics",83,23572148,"MASCOT Score",23.0000000,,,,,,0.0003000
FAFSRSPSR,ph,S,466,true,"Tissue atlas Arabidopsis - ProteomicsDB",114,32188942,"MaxQuant score",158.0200000,0.9984970,,,,7.6716802141163E-5,
TSSSISQSLPLGR,ph,S,509,true,"atm and atr DNA damage response",88,25561503,"MASCOT Score",46.0000000,0.9900000,,,,,0.0500000
TSSSISQSLPLGR,ph,S,509,true,"Phospho cell culture sucrose/TOR",109,30833711,,,0.9591400,,,,,
TSSSISQSLPLGR,ph,S,509,true,"Tissue atlas Arabidopsis - ProteomicsDB",114,32188942,"MaxQuant score",115.2400000,0.9752400,,,,3.9451198972529E-5,
KTSSSISQSLPLGR,ph,S,511,true,"Large-scale phosphorylation discovery",44,23111157,XCorr,3.3900000,,,,,,
KTSSSISQSLPLGR,ph,S,511,true,"atm and atr DNA damage response",88,25561503,"MASCOT Score",31.0000000,0.8950000,,,,,-0.0300000
TSSSISQSLPLGR,ph,S,511,true,"Tissue atlas Arabidopsis - ProteomicsDB",114,32188942,"MaxQuant score",129.0100000,0.8877860,,,,6.6156200773548E-5,
KTSSSISQSLPLGR,ph,S,513,true,"Large-scale phosphorylation discovery",44,23111157,XCorr,3.9660000,,,,,,
KTSSSISQSLPLGR,ph,S,513,true,"atm and atr DNA damage response",88,25561503,"MASCOT Score",41.0000000,1.0000000,,,,,0.6400000
KTSSSISQSLPLGR,ph,S,513,true,"Tissue atlas Arabidopsis - ProteomicsDB",114,32188942,"MaxQuant score",178.0200000,0.9993560,,,,1.1775800048777E-22,
TSSSISQSLPLGR,ph,S,513,true,"srk2dei ABA signaling phopshoproteomics",83,23572148,"MASCOT Score",32.0000000,,,,,,0.0002000
TSSSISQSLPLGR,ph,S,513,true,"atm and atr DNA damage response",88,25561503,"MASCOT Score",66.0000000,0.9960000,,,,,-0.0900000
TSSSISQSLPLGR,ph,S,513,true,"TOR Kinase and ABA Receptor",100,29290610,XCorr,3.4360878,0.9150000,,,,3.4019998565782E-5,
TSSSISQSLPLGR,ph,S,513,true,"Lateral root-induction - NAA vs control",106,23328941,"MASCOT Score",49.0000000,,,,,,
TSSSISQSLPLGR,ph,S,513,true,"Phospho cell culture sucrose/TOR",109,30833711,,,0.9997360,,,,,
RSSQDAAVGVLVHMLK,ph,S,521,true,"TOR Kinase and ABA Receptor",100,29290610,XCorr,4.8373227,0.9474000,,,,2.1899999591568E-9,
RSSQDAAVGVLVHMLK,ph,S,521,true,"Tissue atlas Arabidopsis - ProteomicsDB",114,32188942,"MaxQuant score",147.2600000,0.8830140,,,,1.0997099758603E-10,
SSQDAAVGVLVHMLK,ph,S,521,true,"Phosphorylation in N starvation",63,22060019,"MASCOT Score",20.0000000,,,,,,4.8487600
QDSSTYMASMSGVQR,ph,S,543,true,"Tissue atlas Arabidopsis - ProteomicsDB",114,32188942,"MaxQuant score",98.8820000,0.9407030,,,,5.8561299738358E-6,
QDSSTYMASMSGVQR,ph,S,544,true,"Tissue atlas Arabidopsis - ProteomicsDB",114,32188942,"MaxQuant score",133.9100000,0.9543900,,,,4.7026799165906E-7,
QDSSTYMASMSGVQR,ph,S,551,true,"Tissue atlas Arabidopsis - ProteomicsDB",114,32188942,"MaxQuant score",47.5370000,0.8564480,,,,0.0021707499399781,
EGSVSGTESEFSMAR,ph,S,558,true,"atm and atr DNA damage response",88,25561503,"MASCOT Score",58.0000000,1.0000000,,,,,-0.1000000
EGSVSGTESEFSMAR,ph,S,558,true,"Phospho cell culture sucrose/TOR",109,30833711,,,0.9999990,,,,,
EGSVSGTESEFSMAR,ph,S,558,true,"Tissue atlas Arabidopsis - ProteomicsDB",114,32188942,"MaxQuant score",252.2000000,1.0000000,,,,0,
EGSVSGTESEFSMAR,ph,S,560,true,"Tissue atlas Arabidopsis - ProteomicsDB",114,32188942,"MaxQuant score",184.5100000,0.9999610,,,,2.7622699223032E-25,
EGSVSGTESEFSMAR,ph,S,564,true,"Tissue atlas Arabidopsis - ProteomicsDB",114,32188942,"MaxQuant score",153.2200000,0.9939920,,,,1.858490028539E-9,
STSDALEELR,ph,S,571,true,"atm and atr DNA damage response",88,25561503,"MASCOT Score",54.0000000,0.9980000,,,,,-0.8200000
STSDALEELR,ph,T,572,true,"Tissue atlas Arabidopsis - ProteomicsDB",114,32188942,"MaxQuant score",143.9700000,0.9038890,,,,1.643399968998E-6,
STSDALEELR,ph,S,573,true,"srk2dei ABA signaling phopshoproteomics",83,23572148,"MASCOT Score",57.0000000,,,,,,-0.0001000
STSDALEELR,ph,S,573,true,"LAXIC - mannitol vs control",84b,23660473,XCorr,2.3000000,0.9970000,,,,0.0029255400877446,
STSDALEELR,ph,S,573,true,"Tissue atlas Arabidopsis - ProteomicsDB",114,32188942,"MaxQuant score",137.8900000,0.9999510,,,,1.0920400200121E-5,
