Peptide,PTM,ModifiedAA,ModifiedPosition,PeptideUniqueToGene,ExperimentDesc,ExpID,PubmedID,ScoreType,IdentScore,LocProb,Log2FChange,PQ-val,QuantSig,PEP,MassErrorPPM
SPANWSNNPSYR,ph,S,66,true,"Tissue atlas Arabidopsis - ProteomicsDB",114,32188942,"MaxQuant score",85.4570000,1.0000000,,,,0.00062058999901637,
SQTPSSSFYADNTQHGNSGLRGEDSSYKDMLSPSGFYSSR,og,S,82,true,"O-GlcNac Inflorescence Tissue",81,28154133,"MASCOT Score",31.0000000,,,,,,4.6000000
SQTPSSSFYADNTQHGNSGLRGEDSSYK,og,S,82,true,"O-GlcNac Inflorescence Tissue",81,28154133,"MASCOT Score",37.6000000,,,,,,3.1000000
ENSRSQTPSSSFYADNTQHGNSGLR,og,S,82,true,"O-GlcNac Inflorescence Tissue",81,28154133,"MASCOT Score",38.5000000,,,,,,3.2000000
SQTPSSSFYADNTQHGNSGLR,og,S,82,true,"O-GlcNac Inflorescence Tissue",81,28154133,"MASCOT Score",23.1000000,,,,,,0.0600000
SQTPSSSFYADNTQHGNSGLR,ph,T,84,true,"Tissue atlas Arabidopsis - ProteomicsDB",114,32188942,"MaxQuant score",138.0400000,0.9968270,,,,6.4204301078978E-22,
DMLSPSGFYSSR,ph,S,113,true,"Tissue atlas Arabidopsis - ProteomicsDB",114,32188942,"MaxQuant score",144.5100000,0.9999280,,,,1.3927999589214E-6,
NSQDSFFTPIASSGVYSSSNAVDEK,og,S,177,true,"O-GlcNac Inflorescence Tissue",81,28154133,"MASCOT Score",49.2000000,,,,,,3.6000000
NSQDSFFTPIASSGVYSSSNAVDEK,og,S,178,true,"O-GlcNac Inflorescence Tissue",81,28154133,"MASCOT Score",49.2000000,,,,,,3.6000000
NATEDLNCHEPR,ph,T,371,true,"Lateral root-induction - NAA vs control",106,23328941,"MASCOT Score",30.0000000,,,,,,
NATEDLNCHEPR,ph,T,371,true,"Tissue atlas Arabidopsis - ProteomicsDB",114,32188942,"MaxQuant score",128.8500000,1.0000000,,,,0.00010447399836266,
NATEDLNCHEPR,ox,C,376,true,"OxiTRAQ Arabidopsis - 5 mM H2O2 versus control",47,24376095,,,,0.2886567,0.0777422,NO,,
IRSLTDVGLDLSSR,ph,S,465,true,"Tissue atlas Arabidopsis - ProteomicsDB",114,32188942,"MaxQuant score",181.9800000,0.9981010,,,,6.8538101061E-18,
SLTDVGLDLSSR,ph,T,467,true,"Tissue atlas Arabidopsis - ProteomicsDB",114,32188942,"MaxQuant score",139.7400000,0.9998160,,,,2.7249900085735E-5,
SLTDVGLDLSSR,ph,S,474,true,"Col-0 callus - FC Col-0 vs. Col-0 Xray",111a,31410901,,69.6200000,,0.3147261,0.0000000,NO,,0.2444845
SLTDVGLDLSSR,ph,S,474,true,"Col-0 X-ray callus - FC Col-0 vs. Col-0 Xray",111b,31410901,,69.6200000,,0.3147261,0.0000000,NO,,0.2444845
SLTDVGLDLSSR,ph,S,474,true,"atm callus - FC atm vs. atm Xray",111c,31410901,,69.6200000,,1.8967946,0.0000000,NO,,0.2444845
SLTDVGLDLSSR,ph,S,474,true,"atm-3 X-ray callus - FC atm vs. atm Xray",111d,31410901,,69.6200000,,1.8967946,0.0000000,NO,,0.2444845
SLTDVGLDLSSR,ph,S,474,true,"Tissue atlas Arabidopsis - ProteomicsDB",114,32188942,"MaxQuant score",225.8600000,0.9493870,,,,0,
SNADDVSTGRSPER,ph,S,477,true,"Tissue atlas Arabidopsis - ProteomicsDB",114,32188942,"MaxQuant score",82.5040000,1.0000000,,,,0.0011103199794888,
SLTDVGLDLSSRSNADDVSTGRSPER,ph,S,483,true,"TOR Kinase and ABA Receptor",100,29290610,XCorr,4.1661987,0.8250000,,,,0.052790001034737,
SNADDVSTGRSPER,ph,S,483,true,"Tissue atlas Arabidopsis - ProteomicsDB",114,32188942,"MaxQuant score",134.0400000,0.9737930,,,,2.0136600141996E-5,
SNADDVSTGRSPER,ph,T,484,true,"atm and atr DNA damage response",88,25561503,"MASCOT Score",25.0000000,0.8650000,,,,,-0.4700000
SNADDVSTGRSPER,ph,S,487,true,"Tissue atlas Arabidopsis - ProteomicsDB",114,32188942,"MaxQuant score",146.8100000,0.9990460,,,,1.2578099983784E-7,
HFCDQGDFPSPTSYPR,ph,S,500,true,"TOR Kinase and ABA Receptor",100,29290610,XCorr,2.2424822,0.9158000,,,,0.0086479997262359,
HFCDQGDFPSPTSYPR,ph,S,500,true,"Lateral root-induction - NAA vs control",106,23328941,"MASCOT Score",50.0000000,,,,,,
HFCDQGDFPSPTSYPR,ph,S,500,true,"Phospho cell culture sucrose/TOR",109,30833711,,,0.9817260,,,,,
HFCDQGDFPSPTSYPR,ph,S,500,true,"Col-0 callus - FC Col-0 vs. Col-0 Xray",111a,31410901,,65.7000000,,0.4348484,0.0000000,NO,,1.2584859
HFCDQGDFPSPTSYPR,ph,S,500,true,"Col-0 X-ray callus - FC Col-0 vs. Col-0 Xray",111b,31410901,,65.7000000,,0.4348484,0.0000000,NO,,1.2584859
HFCDQGDFPSPTSYPR,ph,S,500,true,"atm callus - FC atm vs. atm Xray",111c,31410901,,65.7000000,,1.4338763,0.0000000,NO,,1.2584859
HFCDQGDFPSPTSYPR,ph,S,500,true,"atm-3 X-ray callus - FC atm vs. atm Xray",111d,31410901,,65.7000000,,1.4338763,0.0000000,NO,,1.2584859
HFCDQGDFPSPTSYPR,ph,S,500,true,"Tissue atlas Arabidopsis - ProteomicsDB",114,32188942,"MaxQuant score",354.9300000,0.9999600,,,,0,
DFQRFSVKPLDSFGVK,ph,S,596,true,"Tissue atlas Arabidopsis - ProteomicsDB",114,32188942,"MaxQuant score",77.2870000,0.9999910,,,,0.00012368499301374,
FSVKPLDSFGVK,ph,S,602,true,"Tissue atlas Arabidopsis - ProteomicsDB",114,32188942,"MaxQuant score",63.6140000,0.9999920,,,,0.0023543098941445,
EISADAVSFMQEPSLNTQK,ph,S,682,true,"Tissue atlas Arabidopsis - ProteomicsDB",114,32188942,"MaxQuant score",255.9300000,1.0000000,,,,0,
SVPIMNANADKDTPESIIK,ph,S,694,true,"Phospho cell culture sucrose/TOR",109,30833711,,,0.9999720,,,,,
SVPIMNANADKDTPESIIK,ph,S,694,true,"Tissue atlas Arabidopsis - ProteomicsDB",114,32188942,"MaxQuant score",221.0500000,1.0000000,,,,0,
SVPIMNANADKDTPESIIK,ph,S,709,true,"Tissue atlas Arabidopsis - ProteomicsDB",114,32188942,"MaxQuant score",101.5300000,0.9981010,,,,6.9064202534719E-7,
NAATMSHDASESSR,ph,S,725,true,"atm and atr DNA damage response",88,25561503,"MASCOT Score",49.0000000,0.9900000,,,,,-0.6200000
NAATMSHDASESSR,ph,S,725,true,"TOR Kinase and ABA Receptor",100,29290610,XCorr,3.5158174,0.8917000,,,,0.0014359999913722,
NAATMSHDASESSR,ph,S,725,true,"Tissue atlas Arabidopsis - ProteomicsDB",114,32188942,"MaxQuant score",66.1060000,0.9551120,,,,0.00062877900199965,
NAATMSHDASESSR,ph,S,729,true,"atm and atr DNA damage response",88,25561503,"MASCOT Score",45.0000000,0.7710000,,,,,1.4300000
NAATMSHDASESSR,ph,S,729,true,"Tissue atlas Arabidopsis - ProteomicsDB",114,32188942,"MaxQuant score",133.2900000,0.9950560,,,,8.4350003817235E-6,
SFTGGLEQTIR,ph,S,749,true,"Col-0 callus - FC Col-0 vs. Col-0 Xray",111a,31410901,,54.1000000,,3.2615287,0.0000000,NO,,0.4574428
SFTGGLEQTIR,ph,S,749,true,"Col-0 X-ray callus - FC Col-0 vs. Col-0 Xray",111b,31410901,,54.1000000,,3.2615287,0.0000000,NO,,0.4574428
SFTGGLEQTIR,ph,S,749,true,"atm callus - FC atm vs. atm Xray",111c,31410901,,54.1000000,,-2.3898430,0.0000000,NO,,0.4574428
SFTGGLEQTIR,ph,S,749,true,"atm-3 X-ray callus - FC atm vs. atm Xray",111d,31410901,,54.1000000,,-2.3898430,0.0000000,NO,,0.4574428
SFTGGLEQTIR,ph,S,749,true,"Tissue atlas Arabidopsis - ProteomicsDB",114,32188942,"MaxQuant score",216.5300000,0.9974420,,,,2.6893200734454E-32,
SFTGGLEQTIR,og,T,751,true,"O-GlcNac Inflorescence Tissue",81,28154133,"MASCOT Score",37.1000000,,,,,,2.4000000
SFTGGLEQTIR,ph,T,751,true,"TOR Kinase and ABA Receptor",100,29290610,XCorr,2.9124215,0.9984000,,,,0.024819999933243,
SFTGGLEQTIR,ph,T,751,true,"Tissue atlas Arabidopsis - ProteomicsDB",114,32188942,"MaxQuant score",161.3300000,0.9999960,,,,2.6745000658579E-10,
IPDAIWQETSASTTENK,ph,S,781,true,"Tissue atlas Arabidopsis - ProteomicsDB",114,32188942,"MaxQuant score",203.1700000,0.8175740,,,,0,
IPDAIWQETSASTTENK,ph,S,783,true,"Tissue atlas Arabidopsis - ProteomicsDB",114,32188942,"MaxQuant score",135.0900000,0.8522640,,,,4.6962500555026E-10,
LPDSDIDVIDR,ph,S,816,true,"Tissue atlas Arabidopsis - ProteomicsDB",114,32188942,"MaxQuant score",137.6200000,1.0000000,,,,1.5667500292693E-6,
SSDVSDVMDR,ph,S,864,true,"Tissue atlas Arabidopsis - ProteomicsDB",114,32188942,"MaxQuant score",107.3400000,0.7719870,,,,0.00023585300368723,
SSDVSDVMDR,ph,S,865,true,"atm and atr DNA damage response",88,25561503,"MASCOT Score",38.0000000,1.0000000,,,,,-0.6200000
SSDVSDVMDR,ph,S,865,true,"Tissue atlas Arabidopsis - ProteomicsDB",114,32188942,"MaxQuant score",113.3800000,0.8119560,,,,0.00019764200260397,
SSDVSDVMDR,ph,S,868,true,"atm and atr DNA damage response",88,25561503,"MASCOT Score",38.0000000,1.0000000,,,,,-0.6200000
SSDVSDVMDR,ph,S,868,true,"Tissue atlas Arabidopsis - ProteomicsDB",114,32188942,"MaxQuant score",53.2520000,0.9995430,,,,0.0082659004256129,
SLNSMDVDSDSENDQPQKR,ph,S,896,true,"atm and atr DNA damage response",88,25561503,"MASCOT Score",78.0000000,1.0000000,,,,,-0.1000000
SLNSMDVDSDSENDQPQKR,ph,S,896,true,"Tissue atlas Arabidopsis - ProteomicsDB",114,32188942,"MaxQuant score",279.4700000,1.0000000,,,,0,
SLNSMDVDSDSENDQPQK,ph,S,896,true,"atm and atr DNA damage response",88,25561503,"MASCOT Score",55.0000000,1.0000000,,,,,-0.2900000
SLNSMDVDSDSENDQPQK,ph,S,896,true,"TOR Kinase and ABA Receptor",100,29290610,XCorr,6.2681341,0.9995000,,,,3.7639997785277E-9,
SLNSMDVDSDSENDQPQKR,ph,S,898,true,"atm and atr DNA damage response",88,25561503,"MASCOT Score",25.0000000,1.0000000,,,,,0.5000000
SLNSMDVDSDSENDQPQKR,ph,S,898,true,"Tissue atlas Arabidopsis - ProteomicsDB",114,32188942,"MaxQuant score",279.4700000,1.0000000,,,,0,
SLNSMDVDSDSENDQPQK,ph,S,898,true,"TOR Kinase and ABA Receptor",100,29290610,XCorr,5.5424905,1.0000000,,,,7.2399998884976E-8,
GHSQRETCAADTEQSASGK,ph,S,921,true,"Tissue atlas Arabidopsis - ProteomicsDB",114,32188942,"MaxQuant score",54.4650000,0.9036200,,,,0.0005006609717384,
ETCAADTEQSASGK,ox,C,926,true,"OxiTRAQ Arabidopsis - 5 mM H2O2 versus control",47,24376095,,,,0.1328557,0.2034844,NO,,
ETCAADTEQSASGK,ph,S,933,true,"Tissue atlas Arabidopsis - ProteomicsDB",114,32188942,"MaxQuant score",249.4100000,0.9317810,,,,0,
ETCAADTEQSASGK,ph,S,935,true,"Tissue atlas Arabidopsis - ProteomicsDB",114,32188942,"MaxQuant score",241.9800000,0.9944360,,,,0,
GYESPTSDWEHVIKDD,ph,S,941,true,"srk2dei ABA signaling phopshoproteomics",83,23572148,"MASCOT Score",30.0000000,,,,,,0.0008000
GYESPTSDWEHVIKDD,ph,S,941,true,"SnRK2 protein kinase substrates",85,23776212,XCorr,3.3163888,0.9170000,,,,6.3331397541333E-5,
GYESPTSDWEHVIKDD,ph,S,941,true,"Brassinosteroid-Regulated Phosphorylation Dynamics",94,26187819,"MaxQuant Score",131.5600000,0.9330000,,,,6.9339998844953E-6,1.0930000
GYESPTSDWEHVIKDD,ph,S,941,true,"TOR Kinase and ABA Receptor",100,29290610,XCorr,3.2016935,0.9880000,,,,4.4920001528226E-5,
GYESPTSDWEHVIKDD,ph,S,941,true,"Phospho cell culture sucrose/TOR",109,30833711,,,0.9933310,,,,,
GYESPTSDWEHVIKDD,ph,S,941,true,"Col-0 callus - FC Col-0 vs. Col-0 Xray",111a,31410901,,41.2900000,,0.4079850,0.0000000,NO,,3.8685584
GYESPTSDWEHVIKDD,ph,S,941,true,"Col-0 X-ray callus - FC Col-0 vs. Col-0 Xray",111b,31410901,,41.2900000,,0.4079850,0.0000000,NO,,3.8685584
GYESPTSDWEHVIKDD,ph,S,941,true,"atm callus - FC atm vs. atm Xray",111c,31410901,,41.2900000,,1.0418519,0.0000000,NO,,3.8685584
GYESPTSDWEHVIKDD,ph,S,941,true,"atm-3 X-ray callus - FC atm vs. atm Xray",111d,31410901,,41.2900000,,1.0418519,0.0000000,NO,,3.8685584
GYESPTSDWEHVIKDD,ph,S,941,true,"Tissue atlas Arabidopsis - ProteomicsDB",114,32188942,"MaxQuant score",398.3900000,0.9999880,,,,0,
GYESPTSDWEHVIKDD,ph,S,941,true,"Touch-induced phosphorylation: 40s touch vs untouc",136,30291188,"MASCOT score",60.4300000,,-0.2102723,0.2228636,NO,,-2.8154666
GYESPTSDWEHVIKDD,ph,S,944,true,"Brassinosteroid-Regulated Phosphorylation Dynamics",94,26187819,"MaxQuant Score",131.5600000,0.9840000,,,,6.9339998844953E-6,1.5710000
GYESPTSDWEHVIKDD,ph,S,944,true,"Col-0 callus - FC Col-0 vs. Col-0 Xray",111a,31410901,,51.1100000,,0.8340537,0.0000000,NO,,1.3050046
GYESPTSDWEHVIKDD,ph,S,944,true,"Col-0 X-ray callus - FC Col-0 vs. Col-0 Xray",111b,31410901,,51.1100000,,0.8340537,0.0000000,NO,,1.3050046
GYESPTSDWEHVIKDD,ph,S,944,true,"atm callus - FC atm vs. atm Xray",111c,31410901,,51.1100000,,1.3753988,0.0000000,NO,,1.3050046
GYESPTSDWEHVIKDD,ph,S,944,true,"atm-3 X-ray callus - FC atm vs. atm Xray",111d,31410901,,51.1100000,,1.3753988,0.0000000,NO,,1.3050046
GYESPTSDWEHVIKDD,ph,S,944,true,"Tissue atlas Arabidopsis - ProteomicsDB",114,32188942,"MaxQuant score",303.4100000,0.9997260,,,,0,
