Peptide,PTM,ModifiedAA,ModifiedPosition,PeptideUniqueToGene,ExperimentDesc,ExpID,PubmedID,ScoreType,IdentScore,LocProb,Log2FChange,PQ-val,QuantSig,PEP,MassErrorPPM
SIYVGNLPGDIRE,nt,S,8,true,"Arabidopsis translation initiation landscape - NT",167b,35069635,,,,,,,,
EHEIEDIFYK,ph,Y,28,true,"Tissue atlas Arabidopsis - ProteomicsDB",114,32188942,"MaxQuant score",85.7160000,1.0000000,,,,0.0078424802049994,
VPPRPPCYCFVEFEHSRDAEDAIK,ph,S,55,true,"Phospho cell culture sucrose/TOR",109,30833711,,,1.0000000,,,,,
VPPRPPCYCFVEFEHSR,ph,S,55,true,"Tissue atlas Arabidopsis - ProteomicsDB",114,32188942,"MaxQuant score",164.9400000,1.0000000,,,,1.1232000160546E-17,
DAEDAIKGR,ub,K,63,true,"Arabidopsis ubiquitination COFRADIC",40,26744219,"MaxQuant Score",74.9200000,1.0000000,,,,0.0099999997764826,0.2550000
GGYGGGGSGYGGGGGGGGSAR,nt,G,93,true,"Arabidopsis translation initiation landscape - NT",167b,35069635,,,,,,,,
GGYGGGGSGYGGGGGGGGSAR,ph,S,100,true,"Tissue atlas Arabidopsis - ProteomicsDB",114,32188942,"MaxQuant score",52.8770000,0.9918060,,,,0.0012523699551821,
GGYGGGGSGYGGGGGGGGSAR,ph,S,111,true,"Tissue atlas Arabidopsis - ProteomicsDB",114,32188942,"MaxQuant score",108.9400000,0.9999560,,,,2.0290399135175E-12,
FGVSRHSEFR,ph,S,120,true,"Phospho cell culture sucrose/TOR",109,30833711,,,0.7930580,,,,,
GLPSSASWQDLKDHMR,ph,S,131,false,"atm and atr DNA damage response",88,25561503,"MASCOT Score",33.0000000,0.9840000,,,,,0.5200000
GLPSSASWQDLK,ph,S,131,false,"Phospho cell culture sucrose/TOR",109,30833711,,,0.8020280,,,,,
GLPSSASWQDLKDHMR,ph,S,132,false,"atm and atr DNA damage response",88,25561503,"MASCOT Score",52.0000000,0.9800000,,,,,-0.3500000
GLPSSASWQDLKDHMR,ph,S,134,false,"Phospho cell culture sucrose/TOR",109,30833711,,,0.9914210,,,,,
GLPSSASWQDLKDHMR,ph,S,134,false,"Tissue atlas Arabidopsis - ProteomicsDB",114,32188942,"MaxQuant score",128.7900000,0.9981160,,,,2.4750299587595E-8,
GLPSSASWQDLK,ph,S,134,false,"srk2dei ABA signaling phopshoproteomics",83,23572148,"MASCOT Score",55.0000000,,,,,,0.0035000
GLPSSASWQDLK,ph,S,134,false,"atm and atr DNA damage response",88,25561503,"MASCOT Score",67.0000000,1.0000000,,,,,0.2600000
GLPSSASWQDLK,ph,S,134,false,"TOR Kinase and ABA Receptor",100,29290610,XCorr,3.1433890,0.9952000,,,,0.018190000206232,
AGDVCFAEVTR,sno,C,149,true,"hot5-4 / wildtype, FAT-switch S-nitrosoproteome",169,37277371,,,,0.7222809,0.0032740,YES,,
KAGDVCFAEVTR,ph,T,154,true,"Tissue atlas Arabidopsis - ProteomicsDB",114,32188942,"MaxQuant score",78.4010000,1.0000000,,,,0.0040921699255705,
KLDDTEFR,ub,K,178,false,"Arabidopsis ubiquitination COFRADIC",40,26744219,"MaxQuant Score",85.6760000,1.0000000,,,,0.017000000923872,0.7390000
KLDDTEFR,ub,K,178,false,"upl3 mutant / wildtype",168,35926874,"MaxQuant score",82.6450000,1.0000000,-0.3751972,0.2302800,NO,0.0061933300457895,0.3690100
KDLSKSPR,ph,S,245,true,"SnRK2 protein kinase substrates",85,23776212,XCorr,2.8092940,1.0000000,,,,0.057520899921656,
KDLSKSPR,ph,S,245,true,"Tissue atlas Arabidopsis - ProteomicsDB",114,32188942,"MaxQuant score",86.9110000,1.0000000,,,,0.0046072299592197,
KDLSKSPR,ph,S,247,true,"SnRK2 protein kinase substrates",85,23776212,XCorr,2.8092940,1.0000000,,,,0.057520899921656,
KDLSKSPR,ph,S,247,true,"Tissue atlas Arabidopsis - ProteomicsDB",114,32188942,"MaxQuant score",86.9110000,1.0000000,,,,0.0046072299592197,
RSLSRSISK,ph,S,251,true,"Phospho cell culture sucrose/TOR",109,30833711,,,1.0000000,,,,,
SRSPSKSPPK,ph,S,289,true,"Phosphorylation RNA metabolism",22,16807317,,,,,,,,
SRSPSKSPPK,ph,S,291,true,"Phosphorylation RNA metabolism",22,16807317,,,,,,,,
