Peptide,PTM,ModifiedAA,ModifiedPosition,PeptideUniqueToGene,ExperimentDesc,ExpID,PubmedID,ScoreType,IdentScore,LocProb,Log2FChange,PQ-val,QuantSig,PEP,MassErrorPPM
ALAYAYTYQR,ph,T,257,true,"Tissue atlas Arabidopsis - ProteomicsDB",114,32188942,"MaxQuant score",109.2400000,0.9998950,,,,0.00061473302775994,
TVEMDVTTPTSLK,ph,T,342,true,"Tissue atlas Arabidopsis - ProteomicsDB",114,32188942,"MaxQuant score",173.2500000,0.9264250,,,,2.4457299199239E-15,
EYIDLGSYR,ph,S,363,true,"Tissue atlas Arabidopsis - ProteomicsDB",114,32188942,"MaxQuant score",97.9110000,0.9999730,,,,0.0013576300116256,
KSPTHIPSYMAPTASAK,ph,S,373,true,"atm and atr DNA damage response",88,25561503,"MASCOT Score",47.0000000,0.9980000,,,,,-2.1000000
SPTHIPSYMAPTASAK,ph,S,373,true,"atm and atr DNA damage response",88,25561503,"MASCOT Score",47.0000000,0.9970000,,,,,0.6900000
SPTHIPSYMAPTASAK,ph,S,373,true,"TOR Kinase and ABA Receptor",100,29290610,XCorr,3.4666770,0.9818000,,,,0.00095179997151718,
SPTHIPSYMAPTASAK,ph,S,373,true,"Tissue atlas Arabidopsis - ProteomicsDB",114,32188942,"MaxQuant score",142.2300000,0.9779350,,,,4.9853299266545E-10,
SPTHIPSYMAPTASAK,ph,T,375,true,"Tissue atlas Arabidopsis - ProteomicsDB",114,32188942,"MaxQuant score",142.2300000,0.8479740,,,,4.9853299266545E-10,
NGSVNGSGCDSSSSGGAITTGYPGPRSPNPK,ph,S,441,true,"Tissue atlas Arabidopsis - ProteomicsDB",114,32188942,"MaxQuant score",91.2690000,0.8692640,,,,6.0337498642599E-18,
RKPVSPSQSPTGFGK,ph,S,454,true,"Chloroplast kinase substrates",60,19376835,"MASCOT Score",37.9400000,,,,,,-0.3043090
RKPVSPSQSPTGFGK,ph,S,454,true,"srk2dei ABA signaling phopshoproteomics",83,23572148,"MASCOT Score",45.0000000,,,,,,-0.0011000
RKPVSPSQSPTGFGK,ph,S,454,true,"TOR Kinase and ABA Receptor",100,29290610,XCorr,3.8510826,0.9481000,,,,0.025590000674129,
KPVSPSQSPTGFGK,ph,S,454,true,"LAXIC - mannitol vs control",84b,23660473,XCorr,4.2500000,0.9890000,,,,8.0700001490186E-6,
KPVSPSQSPTGFGK,ph,S,454,true,"atm and atr DNA damage response",88,25561503,"MASCOT Score",46.0000000,0.9540000,,,,,-1.5700000
KPVSPSQSPTGFGK,ph,S,454,true,"Tissue atlas Arabidopsis - ProteomicsDB",114,32188942,"MaxQuant score",239.3300000,0.9997900,,,,0,
RKPVSPSQSPTGFGK,ph,S,456,true,"srk2dei ABA signaling phopshoproteomics",83,23572148,"MASCOT Score",45.0000000,,,,,,-0.0011000
RKPVSPSQSPTGFGK,ph,S,456,true,"TOR Kinase and ABA Receptor",100,29290610,XCorr,3.8510826,0.7679000,,,,0.025590000674129,
KPVSPSQSPTGFGK,ph,S,456,true,"LAXIC - mannitol vs control",84b,23660473,XCorr,4.2500000,0.9060000,,,,8.0700001490186E-6,
RKPVSPSQSPTGFGK,ph,S,458,true,"Chloroplast kinase substrates",60,19376835,"MASCOT Score",37.9400000,,,,,,-0.3043090
RKPVSPSQSPTGFGK,ph,S,458,true,"srk2dei ABA signaling phopshoproteomics",83,23572148,"MASCOT Score",44.0000000,,,,,,0.0000000
KPVSPSQSPTGFGK,ph,S,458,true,"atm and atr DNA damage response",88,25561503,"MASCOT Score",46.0000000,1.0000000,,,,,-1.5700000
KPVSPSQSPTGFGK,ph,S,458,true,"Tissue atlas Arabidopsis - ProteomicsDB",114,32188942,"MaxQuant score",213.3600000,0.9990450,,,,0,
