Peptide,PTM,ModifiedAA,ModifiedPosition,PeptideUniqueToGene,ExperimentDesc,ExpID,PubmedID,ScoreType,IdentScore,LocProb,Log2FChange,PQ-val,QuantSig,PEP,MassErrorPPM
MYPTGQQISFQTTPLNVQDPTR,nta,M,1,true,"Characterization plant N-terminal acetylation",6,22223895,"MASCOT Score",40.8600000,,,,,,
MYPTGQQISFQTTPLNVQDPTR,nta,M,1,true,"Arabidopsis translation initiation landscape - NTA",167a,35069635,,,,,,,,
MMNLDQSSPVAR,ph,S,29,true,"Lateral root-induction - NAA vs control",106,23328941,"MASCOT Score",33.0000000,,,,,,
MMNLDQSSPVAR,ph,S,29,true,"Tissue atlas Arabidopsis - ProteomicsDB",114,32188942,"MaxQuant score",132.7900000,0.7992620,,,,7.5878001553065E-6,
MMNLDQSSPVAR,ph,S,30,true,"srk2dei ABA signaling phopshoproteomics",83,23572148,"MASCOT Score",50.0000000,,,,,,0.0018000
MMNLDQSSPVAR,ph,S,30,true,"SnRK2 protein kinase substrates",85,23776212,XCorr,2.4105852,0.9990000,,,,0.0014307299861684,
MMNLDQSSPVAR,ph,S,30,true,"atm and atr DNA damage response",88,25561503,"MASCOT Score",47.0000000,0.9920000,,,,,-0.2600000
MMNLDQSSPVAR,ph,S,30,true,"TOR Kinase and ABA Receptor",100,29290610,XCorr,2.7563114,0.9142000,,,,0.0094290003180504,
MMNLDQSSPVAR,ph,S,30,true,"Phospho cell culture sucrose/TOR",109,30833711,,,0.9755410,,,,,
MMNLDQSSPVAR,ph,S,30,true,"Tissue atlas Arabidopsis - ProteomicsDB",114,32188942,"MaxQuant score",257.7600000,0.9998390,,,,0,
LNSSPTPR,ph,S,101,true,"atm and atr DNA damage response",88,25561503,"MASCOT Score",37.0000000,0.9490000,,,,,1.0300000
LNSSPTPR,ph,S,101,true,"Tissue atlas Arabidopsis - ProteomicsDB",114,32188942,"MaxQuant score",157.7800000,0.9986460,,,,0.0013349000364542,
LNSSPTPR,ph,T,103,true,"atm and atr DNA damage response",88,25561503,"MASCOT Score",33.0000000,0.9540000,,,,,0.4700000
LNSSPTPR,ph,T,103,true,"Tissue atlas Arabidopsis - ProteomicsDB",114,32188942,"MaxQuant score",110.4700000,0.8350860,,,,0.010087500326335,
SMLAVVCR,so,C,186,true,"Arabidopsis S-sulfenylation chemoproteomics",108,31578252,"pFind PSM Score",0.2183510,,0.9259300,,,,-0.7692256
CLAQSSCTNQPMNTPR,ph,T,418,true,"Tissue atlas Arabidopsis - ProteomicsDB",114,32188942,"MaxQuant score",271.2700000,1.0000000,,,,0,
