Peptide,PTM,ModifiedAA,ModifiedPosition,PeptideUniqueToGene,ExperimentDesc,ExpID,PubmedID,ScoreType,IdentScore,LocProb,Log2FChange,PQ-val,QuantSig,PEP,MassErrorPPM
SFATQEEAAAERR,nt,S,35,true,"Mitochondrial intermediate peptidases - icp55 / WT",131a,25732537,,48.0800000,,-3.4641060,,,,
SFATQEEAAAERR,nt,S,35,true,"Mitochondrial intermediate peptidases - oct1-2 / WT",131c,25732537,,40.9700000,,-3.2719949,,,,
SFATQEEAAAERR,nt,S,35,true,"Arabidopsis translation initiation landscape - NT",167b,35069635,,,,,,,,
SFATQEEAAAER,nt,S,35,true,"Tic56 chloroplast import - tic56-1",89c,25588737,XCorr,2.7551126,,,,,,
SFATQEEAAAER,nt,S,35,true,"FtsH12 N-terminome: WT / FtsH12 knockdown miRNA",118,33216923,"MaxQuant score",78.0980000,,0.0496878,0.7386522,NO,0.0015476000262424,
SFATQEEAAAER,nt,S,35,true,"Mitochondrial intermediate peptidases - oct1-1 / WT",131b,25732537,,71.6300000,,-6.6438562,,,,
HSVYSNCR,so,C,126,true,"Arabidopsis S-sulfenylation chemoproteomics",108,31578252,"pFind PSM Score",0.0361332,,1.4938700,,,,-1.0506806
EAMECYEEAVGENSK,so,C,295,true,"Arabidopsis S-sulfenylation chemoproteomics",108,31578252,"pFind PSM Score",0.0289927,,,,,,-1.0266723
HLAVNLGTFNVMVNGYCAGGK,ph,Y,360,true,"TOR Kinase and ABA Receptor",100,29290610,XCorr,3.0027177,0.9996000,,,,0.019379999488592,
GVEAGGSNGQDPPSC,ox,C,629,true,"OxiTRAQ Arabidopsis - 5 mM H2O2 versus control",47,24376095,,,,1.6443498,0.0393108,NO,,
