Peptide,PTM,ModifiedAA,ModifiedPosition,PeptideUniqueToGene,ExperimentDesc,ExpID,PubmedID,ScoreType,IdentScore,LocProb,Log2FChange,PQ-val,QuantSig,PEP,MassErrorPPM
KLADSNSTTNGNK,ph,T,331,true,"Tyrosine phosphorylation in Arabidopsis",59,18463617,"MASCOT Score",21.0000000,,,,,,0.9099653
AGGDESEIDSSQDEK,ph,S,355,true,"STN8 phosphoproteome",38,21768351,"MASCOT Score",90.1700000,,,,,,-1.2335300
AGGDESEIDSSQDEK,ph,S,355,true,"Chloroplast kinase substrates",60,19376835,"MASCOT Score",90.8900000,,,,,,-1.2335300
AGGDESEIDSSQDEK,ph,S,355,true,"LAXIC - ABA stress",84a,23660473,XCorr,5.3600000,1.0000000,,,,5.1199999795415E-9,
AGGDESEIDSSQDEK,ph,S,355,true,"LAXIC - mannitol vs control",84b,23660473,XCorr,4.7800000,1.0000000,,,,9.8800002901189E-11,
AGGDESEIDSSQDEK,ph,S,355,true,"SnRK2 protein kinase substrates",85,23776212,XCorr,4.7152848,1.0000000,,,,0.00189983996097,
AGGDESEIDSSQDEK,ph,S,355,true,"atm and atr DNA damage response",88,25561503,"MASCOT Score",40.0000000,1.0000000,,,,,-0.5100000
AGGDESEIDSSQDEK,ph,S,355,true,"TOR Kinase and ABA Receptor",100,29290610,XCorr,5.4158249,0.9994000,,,,4.6499999371008E-6,
AGGDESEIDSSQDEK,ph,S,355,true,"Lateral root-induction - NAA vs control",106,23328941,"MASCOT Score",51.0000000,,,,,,
AGGDESEIDSSQDEK,ph,S,355,true,"Phospho cell culture sucrose/TOR",109,30833711,,,0.9999570,,,,,
AGGDESEIDSSQDEK,ph,S,355,true,"Tissue atlas Arabidopsis - ProteomicsDB",114,32188942,"MaxQuant score",453.6800000,1.0000000,,,,0,
LITAQGDQTEVEVEDVR,nt,L,381,true,"Arg/N-end rule seed, prt6 vs. Wt",99,29168982,"MASCOT Score",70.6100000,,-0.3926677,0.1998538,NO,0.0028729999903589,-1.9648557
LITAQGDQTE,nt,L,381,true,"Arg/N-end rule seed, prt6 vs. Wt",99,29168982,"MASCOT Score",56.2100000,,0.0583324,0.5143381,NO,0.0002156999980798,-3.0496437
