Peptide,PTM,ModifiedAA,ModifiedPosition,PeptideUniqueToGene,ExperimentDesc,ExpID,PubmedID,ScoreType,IdentScore,LocProb,Log2FChange,PQ-val,QuantSig,PEP,MassErrorPPM
MDSDTLSGLLENVAKKFPDRRAL,nta,M,1,true,"Arabidopsis translation initiation landscape - NTA",167a,35069635,,,,,,,,
MDSDTLSGLLENVAKKFPDRR,nta,M,1,true,"FtsH12 N-terminome: WT / FtsH12 knockdown miRNA",118,33216923,"MaxQuant score",177.9700000,,,,,3.8499999026714E-25,
MDSDTLSGLLENVAKKFPDRR,nta,M,1,true,"HUNTER N-terminome: legumain, GluC and trypsin",119,31951383,"MaxQuant score",78.7940000,,,,,,
MDSDTLSGLLENVAKKFPDR,nta,M,1,true,"N-terminal ChaFRADIC",92,26010716,"MASCOT Score",31.1200000,,,,,2.1549999473791E-7,
MDSDTLSGLLENVAKKFPDR,nta,M,1,true,"Stromal N-terminome",96,26371235,"MASCOT Score",31.2300000,,,,,,
MDSDTLSGLLENVAKKFPDR,nta,M,1,true,"FtsH12 N-terminome: WT / FtsH12 knockdown miRNA",118,33216923,"MaxQuant score",195.0600000,,,,,8.6899999035749E-26,
MDSDTLSGLLENVAKKFPDR,nta,M,1,true,"HUNTER N-terminome: legumain, GluC and trypsin",119,31951383,"MaxQuant score",69.1480000,,,,,,
MDSDTLSGLLENVAK,nta,M,1,true,"Characterization plant N-terminal acetylation",6,22223895,"MASCOT Score",99.9300000,,,,,,
MDSDTLSGLL,nta,M,1,true,"N-term acetylation drought responses",5,26184543,,,,,,,,
SDTLSGLLE,nt,S,3,true,"Arg/N-end rule seed, prt6 vs. Wt",99,29168982,"MASCOT Score",43.2200000,,0.3205431,0.6485596,NO,0.017890000715852,-0.5894766
MDSDTLSGLLENVAK,ph,S,3,true,"SIRK1 phosphorylation",86a,23820729,"MaxQuant Score",104.2100000,0.9810000,,,,0.24899999797344,3.6370000
MDSDTLSGLLENVAK,ph,S,3,true,"SIRK1 exp - sirk1 mutant vs WT",86b,23820729,,,,-0.4474415,,NO,,
MDSDTLSGLLENVAK,ph,S,3,true,"SIRK1 exp - 35S:SIRK1 vs WT",86c,23820729,,,,0.4631246,,NO,,
LLLTSKEGNAPAQEAASK,ub,K,111,true,"Ubiquitination Membrane Proteins",120,33585938,,,,,,,,
LLLTSKEGNAPAQEAASK,ub,K,111,true,"upl3 mutant / wildtype",168,35926874,"MaxQuant score",116.0600000,1.0000000,0.6906406,0.3627600,NO,5.8104098789313E-12,0.0514290
SDSVVDSATE,nt,S,147,true,"Arg/N-end rule seed, prt6 vs. Wt",99,29168982,"MASCOT Score",61.9500000,,-0.3471760,0.4793016,NO,0.00065639999229461,-3.4373412
DSATELVNHPD,nt,D,152,true,"Arabidopsis translation initiation landscape - NT",167b,35069635,,,,,,,,
SLGAGAAVTLPAAGR,nta,S,225,true,"FtsH12 N-terminome: WT / FtsH12 knockdown miRNA",118,33216923,"MaxQuant score",47.7190000,,,,,0.00028390000807121,
HASHPETEYPKLR,nt,H,271,true,"Arabidopsis translation initiation landscape - NT",167b,35069635,,,,,,,,
SHPETEYPKLR,nt,S,273,true,"N-terminal ChaFRADIC",92,26010716,"MASCOT Score",30.6700000,,,,,0.00022060000628699,
SHPETEYPKL,nt,S,273,true,"N-terminal ChaFRADIC",92,26010716,"MASCOT Score",21.0400000,,,,,1.951000012923E-5,
SCSASLAPVILSR,nt,S,287,true,"N-terminal ChaFRADIC",92,26010716,"MASCOT Score",42.1200000,,,,,7.5380000907899E-8,
SCSASLAPVILSR,nt,S,287,true,"Arabidopsis translation initiation landscape - NT",167b,35069635,,,,,,,,
SCSASLAPVILSR,cn,C,288,true,"Cellular regulation by S-cyanylation",115,30377236,,,,,,,,
SCSASLAPVILSR,ox,C,288,true,"OxiTRAQ Arabidopsis - 5 mM H2O2 versus control",47,24376095,,,,0.8154205,0.0206954,YES,,
SCSASLAPVILSR,ox,C,288,true,"Bicarbonate Induced Redox Changes - 5 min",117a,28184230,,,,-0.0291463,,YES,,
SCSASLAPVILSR,sno,C,288,true,"hot5-4 / wildtype, FAT-switch S-nitrosoproteome",169,37277371,,,,0.0655499,0.7647828,NO,,
SCSASLAPVILSR,so,C,288,true,"Arabidopsis S-sulfenylation chemoproteomics",108,31578252,"pFind PSM Score",0.0220389,,1.0056600,,,,-0.3362552
SCSASLAPVILSR,so,C,288,true,"S-sulfenylation site detection using YAP1C",110,32714340,,,,,,,,
SASLAPVILSRLE,nt,S,289,true,"Arg/N-end rule seed, prt6 vs. Wt",99,29168982,"MASCOT Score",29.3400000,,-0.2373786,0.0192145,NO,0.00010050000128103,-0.8015252
SASLAPVILSR,nt,S,289,true,"Arg/N-end rule seed, prt6 vs. Wt",99,29168982,"MASCOT Score",49.9200000,,-0.4766348,0.0321017,NO,0.013199999928474,-1.6468609
SCSASLAPVILSR,ph,S,289,true,"Tissue atlas Arabidopsis - ProteomicsDB",114,32188942,"MaxQuant score",157.4300000,0.9988870,,,,5.9197802215749E-10,
SSNPLPEEGPHKPG,nt,S,322,true,"N-terminal ChaFRADIC",92,26010716,"MASCOT Score",23.4700000,,,,,5.5070001891977E-9,
GEIQEPNNKGEVCIR,ub,K,360,true,"upl3 mutant / wildtype",168,35926874,"MaxQuant score",58.8850000,1.0000000,-0.8889687,0.4202600,NO,0.0004146590072196,0.3670000
GEIQEPNNKGEVCIR,sno,C,364,true,"Site-specific nitrosomeproteomic id - gsnor1-3",90a,25699590,XCorr,3.0715618,,,,,0.0023129999171942,-2.7398811
GEIQEPNNKGEVCIR,sno,C,364,true,"Site-specific nitrosomeproteomic id - gsnor1-3",90b,25699590,XCorr,2.9000000,,,,,0.15979999303818,-7.2000000
GEVCIR,sno,C,364,true,"hot5-4 / wildtype, FAT-switch S-nitrosoproteome",169,37277371,,,,,,,,
GEIQEPNNKGEVCIR,so,C,364,true,"Arabidopsis S-sulfenylation chemoproteomics",108,31578252,"pFind PSM Score",0.1937930,,,,,,0.6028493
GYKNNPEANK,ac,K,375,true,"Quantitative Acetylproteomics",101,29440448,,,,,,,,
YGEEINCAVIPR,sno,C,455,true,"Site-specific nitrosomeproteomic id - gsnor1-3",90a,25699590,XCorr,2.8300000,,,,,0.00044969998998567,-7.2200000
YGEEINCAVIPR,sno,C,455,true,"Site-specific nitrosomeproteomic id - gsnor1-3",90b,25699590,XCorr,2.9300000,,,,,0.047219999134541,-7.2200000
YGEEINCAVIPR,sno,C,455,true,"hot5-4 / wildtype, FAT-switch S-nitrosoproteome",169,37277371,,,,,,,,
YGEEINCAVIPR,so,C,455,true,"Arabidopsis S-sulfenylation chemoproteomics",108,31578252,"pFind PSM Score",0.0056173,,0.9340600,,,,-1.0798090
YGEEINCAVIPR,so,C,455,true,"S-sulfenylation site detection using YAP1C",110,32714340,,,,,,,,
RVFITDNLPKTASGK,ac,K,495,true,"Quantitative Acetylproteomics",101,29440448,,,,,,,,
VFITDNLPKTASGK,ac,K,495,true,"Quantitative Acetylproteomics",101,29440448,,,,,,,,
VFITDNLPKTASGKIQR,ub,K,495,true,"Arabidopsis ubiquitination COFRADIC",40,26744219,"MaxQuant Score",62.2030000,0.9960000,,,,7.5189996451286E-9,-0.1280000
IVAQHFLEKP,ac,K,513,true,"Histone deacetylases - apicidin vs control",98a,29061669,"MaxQuant Score",86.9000000,1.0000000,0.2650000,0.3076097,NO,0.00015000000712462,
IVAQHFLEKP,ac,K,513,true,"Histone deacetylases substrates - hda14 vs WT",98e,29061669,"MaxQuant Score",76.2000000,1.0000000,0.0800000,0.9120108,NO,0.0020000000949949,
IVAQHFLEKP,ac,K,513,true,"Quantitative Acetylproteomics",101,29440448,,,,,,,,
