Peptide,PTM,ModifiedAA,ModifiedPosition,PeptideUniqueToGene,ExperimentDesc,ExpID,PubmedID,ScoreType,IdentScore,LocProb,Log2FChange,PQ-val,QuantSig,PEP,MassErrorPPM
AEQTEKAFLKQPK,nt,A,2,false,"Stromal N-terminome",96,26371235,"MASCOT Score",38.4800000,,,,,,
AEQTEKAFL,nt,A,2,false,"Arg/N-end rule seed, prt6 vs. Wt",99,29168982,"MASCOT Score",37.0200000,,,,,0.15760000050068,-3.7208394
AEQTEKAF,nt,A,2,false,"Arg/N-end rule seed, prt6 vs. Wt",99,29168982,"MASCOT Score",28.8200000,,0.2227871,0.1163639,NO,0.20970000326633,-0.1289212
AEQTEKAFLKQPKVFLSSK,nta,A,2,false,"Arg/N-end rule pathway Roots",80,25728785,"MASCOT Score",30.7900000,,,,,0.0023209999781102,
AEQTEKAFLKQPKVFL,nta,A,2,false,"Arg/N-end rule pathway Roots",80,25728785,"MASCOT Score",33.4900000,,,,,5.4269999964163E-5,
AEQTEKAFLKQPKVFL,nta,A,2,false,"Arabidopsis translation initiation landscape - NTA",167a,35069635,,,,,,,,
AEQTEKAFLKQPKVF,nta,A,2,false,"Arg/N-end rule pathway Roots",80,25728785,"MASCOT Score",41.2700000,,,,,2.483000025677E-5,
AEQTEKAFLKQPK,nta,A,2,false,"Arg/N-end rule pathway Roots",80,25728785,"MASCOT Score",20.2400000,,,,,0.045460000634193,
AEQTEKAFLKQPK,nta,A,2,false,"Stromal N-terminome",96,26371235,"MASCOT Score",38.4800000,,,,,,
AEQTEKAFLK,nta,A,2,false,"Arg/N-end rule pathway Roots",80,25728785,"MASCOT Score",41.4300000,,,,,0.0030819999519736,
AEQTEKAFL,nta,A,2,false,"Arg/N-end rule seed, prt6 vs. Wt",99,29168982,"MASCOT Score",37.0200000,,0.0320235,0.9277380,NO,0.15760000050068,-3.7208394
AFLKQPK,ac,K,11,false,"Histone deacetylases - apicidin vs control",98a,29061669,"MaxQuant Score",119.6000000,1.0000000,0.0620000,0.7345139,NO,0.00076999998418614,
QPKVFLSSKK,ub,K,20,false,"Arabidopsis ubiquitination by TUBEs",2,23667124,,,,,,,,
FWKNIGLGFK,ac,K,37,false,"Quantitative Acetylproteomics",101,29440448,,,,,,,,
NIGLGFKTPR,ac,K,44,false,"Histone deacetylases - apicidin vs control",98a,29061669,"MaxQuant Score",132.2000000,1.0000000,0.2650000,0.2264644,NO,3.9999999756901E-8,
NIGLGFKTPR,ac,K,44,false,"Histone deacetylases substrates - TSA vs control",98b,29061669,"MaxQuant Score",132.2000000,1.0000000,0.0650000,0.9977001,NO,3.9999999756901E-8,
NIGLGFKTPR,ac,K,44,false,"Histone deacetylases- hda14 vs WT (low light)",98c,29061669,"MaxQuant Score",116.7500000,1.0000000,-2.2740000,0.9885531,NO,0.0020000000949949,
NIGLGFKTPR,ac,K,44,false,"Histone deacetylases substrates - hda14 vs WT",98e,29061669,"MaxQuant Score",74.6000000,1.0000000,-0.0650000,0.9289664,NO,0.00065000000176951,
NIGLGFKTPR,ac,K,44,false,"Quantitative Acetylproteomics",101,29440448,,,,,,,,
NIGLGFKTPR,ph,T,45,false,"atm and atr DNA damage response",88,25561503,"MASCOT Score",32.0000000,1.0000000,,,,,-0.7300000
NIGLGFKTPR,ph,T,45,false,"Tissue atlas Arabidopsis - ProteomicsDB",114,32188942,"MaxQuant score",81.7890000,1.0000000,,,,0.0031649998854846,
EAIDGAYVDKKCPFTGTVSIR,nt,E,48,true,"Arabidopsis translation initiation landscape - NT",167b,35069635,,,,,,,,
EAIDGAYVDKK,ac,K,57,true,"Histone deacetylases - apicidin vs control",98a,29061669,"MaxQuant Score",94.1000000,1.0000000,-0.2130000,0.2937650,NO,0.0060000000521541,
EAIDGAYVDKK,ac,K,57,true,"Quantitative Acetylproteomics",101,29440448,,,,,,,,
CPFTGTVSIR,acy,C,59,false,"Arabidopsis S-acylation atlas - Hypocotyl",163b,35681017,,,,,,,,
CPFTGTVSIR,ox,C,59,false,"OxiTRAQ Arabidopsis - 5 mM H2O2 versus control",47,24376095,,,,0.1547130,0.1721203,NO,,
CPFTGTVSIR,sno,C,59,false,"Cold stress nitrosylation - 4°C vs 22°C",65,24388526,,,,,,,,
KCPFTGTVSIR,so,C,59,false,"S-sulfenylation site detection using YAP1C",110,32714340,,,,,,,,
CPFTGTVSIR,ph,S,66,false,"Tissue atlas Arabidopsis - ProteomicsDB",114,32188942,"MaxQuant score",105.3600000,0.9185690,,,,0.00028267700690776,
GTCHSAKMQR,nt,G,74,false,"Arabidopsis translation initiation landscape - NT",167b,35069635,,,,,,,,
ILAGTCHSAK,ox,C,76,false,"OxiTRAQ Arabidopsis - 5 mM H2O2 versus control",47,24376095,,,,0.3514322,0.0696610,NO,,
ILAGTCHSAK,sno,C,76,false,"hot5-4 / wildtype, FAT-switch S-nitrosoproteome",169,37277371,,,,,,,,
ILAGTCHSAK,so,C,76,false,"Arabidopsis S-sulfenylation chemoproteomics",108,31578252,"pFind PSM Score",0.0678281,,0.8547600,,,,-1.3883882
ILAGTCHSAK,so,C,76,false,"S-sulfenylation site detection using YAP1C",110,32714340,,,,,,,,
DYLHFVKKYQR,nt,D,90,true,"Arabidopsis translation initiation landscape - NT",167b,35069635,,,,,,,,
RHSNIPAHVSPCFR,ph,S,106,false,"TOR Kinase and ABA Receptor",100,29290610,XCorr,3.7845669,1.0000000,,,,0.00094200001331046,
RHSNIPAHVSPCFR,ph,S,106,false,"Tissue atlas Arabidopsis - ProteomicsDB",114,32188942,"MaxQuant score",88.4480000,1.0000000,,,,8.8110296928789E-5,
HSNIPAHVSPCFR,ph,S,113,false,"Tissue atlas Arabidopsis - ProteomicsDB",114,32188942,"MaxQuant score",47.7260000,0.9998430,,,,0.0073389997705817,
HSNIPAHVSPCFR,sno,C,115,false,"Site-specific nitrosomeproteomic id - gsnor1-3",90a,25699590,XCorr,3.7718029,,,,,6.7730002228927E-6,-4.6794582
HSNIPAHVSPCFR,sno,C,115,false,"Site-specific nitrosomeproteomic id - gsnor1-3",90b,25699590,XCorr,3.5300000,,,,,0.00080179999349639,-7.6400000
HSNIPAHVSPCFR,so,C,115,false,"Arabidopsis S-sulfenylation chemoproteomics",108,31578252,"pFind PSM Score",0.0269957,,0.8849600,,,,-0.4642996
HSNIPAHVSPCFR,so,C,115,false,"S-sulfenylation site detection using YAP1C",110,32714340,,,,,,,,
VKEGDHIIIGQCRPLSK,so,C,129,true,"S-sulfenylation site detection using YAP1C",110,32714340,,,,,,,,
EGDHIIIGQCR,so,C,129,true,"Arabidopsis S-sulfenylation chemoproteomics",108,31578252,"pFind PSM Score",0.0022640,,0.6289300,,,,-0.8355740
PLSKTVR,ub,K,134,false,"Arabidopsis ubiquitination COFRADIC",40,26744219,"MaxQuant Score",116.5400000,1.0000000,,,,0.0080000003799796,0.0090000
VIPAGSSSSFGK,ph,S,148,true,"Tissue atlas Arabidopsis - ProteomicsDB",114,32188942,"MaxQuant score",105.6500000,0.8963970,,,,8.8893903011922E-5,
VIPAGSSSSFGK,ph,S,149,true,"atm and atr DNA damage response",88,25561503,"MASCOT Score",61.0000000,0.9250000,,,,,-1.1000000
VIPAGSSSSFGKK,ph,S,151,true,"atm and atr DNA damage response",88,25561503,"MASCOT Score",48.0000000,1.0000000,,,,,-0.9100000
