Peptide,PTM,ModifiedAA,ModifiedPosition,PeptideUniqueToGene,ExperimentDesc,ExpID,PubmedID,ScoreType,IdentScore,LocProb,Log2FChange,PQ-val,QuantSig,PEP,MassErrorPPM
LYDGSDSKKPLLMAIK,ph,S,84,true,"Tissue atlas Arabidopsis - ProteomicsDB",114,32188942,"MaxQuant score",92.3900000,0.9884750,,,,3.5861499782186E-5,
MFYGPGGPYALFAGKDASR,ub,K,118,false,"Ubiquitination Membrane Proteins",120,33585938,,,,,,,,
MFYGPGGPYALFAGKDASR,ub,K,118,false,"upl3 mutant / wildtype",168,35926874,"MaxQuant score",63.3020000,1.0000000,0.2497487,,,9.5393297669943E-5,-0.8906000
FMSKYVK,ub,K,159,true,"Ubiquitination Membrane Proteins",120,33585938,,,,,,,,
DGEGKESSEPSEAK,ph,S,177,true,"atm and atr DNA damage response",88,25561503,"MASCOT Score",25.0000000,0.9320000,,,,,-1.1100000
ESSEPSEAK,ph,S,177,true,"atm and atr DNA damage response",88,25561503,"MASCOT Score",35.0000000,0.9950000,,,,,1.1300000
DGEGKESSEPSEAKTASAEGLSTNTGEEASAITHDETSR,ub,K,183,true,"Ubiquitination Membrane Proteins",120,33585938,,,,,,,,
ESSEPSEAKTASAEGLSTNTGEEASAITHDETSR,ub,K,183,true,"upl3 mutant / wildtype",168,35926874,"MaxQuant score",138.0200000,1.0000000,-1.4779443,0.3401600,NO,5.6967101103137E-33,0.1170800
ESSEPSEAKTASAEGLSTNTGEEASAITHDETSR,ph,T,184,true,"Tissue atlas Arabidopsis - ProteomicsDB",114,32188942,"MaxQuant score",129.8900000,0.9926250,,,,0,
TASAEGLSTNTGEEASAITHDETSR,ph,T,184,true,"Col-0 callus - FC Col-0 vs. Col-0 Xray",111a,31410901,,47.7200000,,-0.6835891,0.0000000,NO,,1.1614358
TASAEGLSTNTGEEASAITHDETSR,ph,T,184,true,"Col-0 X-ray callus - FC Col-0 vs. Col-0 Xray",111b,31410901,,47.7200000,,-0.6835891,0.0000000,NO,,1.1614358
TASAEGLSTNTGEEASAITHDETSR,ph,T,184,true,"atm callus - FC atm vs. atm Xray",111c,31410901,,47.7200000,,0.7650189,0.0000000,NO,,1.1614358
TASAEGLSTNTGEEASAITHDETSR,ph,T,184,true,"atm-3 X-ray callus - FC atm vs. atm Xray",111d,31410901,,47.7200000,,0.7650189,0.0000000,NO,,1.1614358
TASAEGLSTNTGEEASAITHDETSR,ph,S,186,true,"atm and atr DNA damage response",88,25561503,"MASCOT Score",114.0000000,0.9930000,,,,,-0.2000000
TASAEGLSTNTGEEASAITHDETSR,ph,S,186,true,"Col-0 callus - FC Col-0 vs. Col-0 Xray",111a,31410901,,120.1100000,,-1.2925663,0.0236316,YES,,1.2626432
TASAEGLSTNTGEEASAITHDETSR,ph,S,186,true,"Col-0 X-ray callus - FC Col-0 vs. Col-0 Xray",111b,31410901,,120.1100000,,-1.2925663,0.0236316,YES,,1.2626432
TASAEGLSTNTGEEASAITHDETSR,ph,S,186,true,"atm callus - FC atm vs. atm Xray",111c,31410901,,120.1100000,,1.3927545,0.1168729,NO,,1.2626432
TASAEGLSTNTGEEASAITHDETSR,ph,S,186,true,"atm-3 X-ray callus - FC atm vs. atm Xray",111d,31410901,,120.1100000,,1.3927545,0.1168729,NO,,1.2626432
TASAEGLSTNTGEEASAITHDETSR,ph,S,186,true,"Tissue atlas Arabidopsis - ProteomicsDB",114,32188942,"MaxQuant score",261.8100000,0.9999980,,,,0,
TASAEGLSTNTGEEASAITHDETSR,ph,S,191,true,"Tissue atlas Arabidopsis - ProteomicsDB",114,32188942,"MaxQuant score",236.0800000,0.9984510,,,,0,
TASAEGLSTNTGEEASAITHDETSR,ph,T,192,true,"Tissue atlas Arabidopsis - ProteomicsDB",114,32188942,"MaxQuant score",167.0700000,0.9288900,,,,0,
TASAEGLSTNTGEEASAITHDETSR,ph,T,194,true,"Tissue atlas Arabidopsis - ProteomicsDB",114,32188942,"MaxQuant score",187.2900000,0.9952830,,,,0,
TASAEGLSTNTGEEASAITHDETSR,ph,S,199,true,"Tissue atlas Arabidopsis - ProteomicsDB",114,32188942,"MaxQuant score",254.7500000,0.9977610,,,,0,
TASAEGLSTNTGEEASAITHDETSR,ph,T,202,true,"Tissue atlas Arabidopsis - ProteomicsDB",114,32188942,"MaxQuant score",221.3000000,0.9723110,,,,0,
KDVATDDDDAAKE,ph,T,225,true,"STN8 phosphoproteome",38,21768351,"MASCOT Score",114.4000000,,,,,,-0.9109630
KDVATDDDDAAKE,ph,T,225,true,"Phosphoproteome iron-deficient Arabidopsis roots",41,22438062,"MASCOT Score",49.6100000,,,,,,
KDVATDDDDAAKE,ph,T,225,true,"Chloroplast kinase substrates",60,19376835,"MASCOT Score",108.6400000,,,,,,-0.6259440
KDVATDDDDAAKE,ph,T,225,true,"LAXIC - ABA stress",84a,23660473,XCorr,4.8200000,1.0000000,,,,0.0011663200566545,
KDVATDDDDAAKE,ph,T,225,true,"LAXIC - mannitol vs control",84b,23660473,XCorr,5.3800000,1.0000000,,,,1.3500000022759E-5,
KDVATDDDDAAKE,ph,T,225,true,"SnRK2 protein kinase substrates",85,23776212,XCorr,5.4263792,1.0000000,,,,6.4971899388366E-15,
KDVATDDDDAAKE,ph,T,225,true,"atm and atr DNA damage response",88,25561503,"MASCOT Score",58.0000000,1.0000000,,,,,-1.2500000
KDVATDDDDAAKE,ph,T,225,true,"TOR Kinase and ABA Receptor",100,29290610,XCorr,5.2849336,1.0000000,,,,7.6219999201044E-9,
KDVATDDDDAAKE,ph,T,225,true,"Phospho cell culture sucrose/TOR",109,30833711,,,1.0000000,,,,,
KDVATDDDDAAKE,ph,T,225,true,"Tissue atlas Arabidopsis - ProteomicsDB",114,32188942,"MaxQuant score",252.3800000,1.0000000,,,,0,
DVATDDDDAAKE,ph,T,225,true,"STN8 phosphoproteome",38,21768351,"MASCOT Score",81.2600000,,,,,,-0.2864250
DVATDDDDAAKE,ph,T,225,true,"Large-scale phosphorylation discovery",44,23111157,XCorr,4.3650000,,,,,,
DVATDDDDAAKE,ph,T,225,true,"Tyrosine phosphorylation in Arabidopsis",59,18463617,"MASCOT Score",52.0000000,,,,,,-1.0420735
DVATDDDDAAKE,ph,T,225,true,"Chloroplast kinase substrates",60,19376835,"MASCOT Score",80.3400000,,,,,,-0.2864250
DVATDDDDAAKE,ph,T,225,true,"SnRK2 protein kinase substrates",85,23776212,XCorr,3.9792371,1.0000000,,,,0.0042585399933159,
DVATDDDDAAKE,ph,T,225,true,"atm and atr DNA damage response",88,25561503,"MASCOT Score",74.0000000,1.0000000,,,,,0.2000000
DVATDDDDAAKE,ph,T,225,true,"TOR Kinase and ABA Receptor",100,29290610,XCorr,4.0619559,1.0000000,,,,2.4880000637495E-6,
DVATDDDDAAKE,ph,T,225,true,"Col-0 callus - FC Col-0 vs. Col-0 Xray",111a,31410901,,70.0900000,,0.9533302,0.0000000,NO,,0.4089771
DVATDDDDAAKE,ph,T,225,true,"Col-0 X-ray callus - FC Col-0 vs. Col-0 Xray",111b,31410901,,70.0900000,,0.9533302,0.0000000,NO,,0.4089771
DVATDDDDAAKE,ph,T,225,true,"atm callus - FC atm vs. atm Xray",111c,31410901,,70.0900000,,-2.9644895,0.0000000,NO,,0.4089771
DVATDDDDAAKE,ph,T,225,true,"atm-3 X-ray callus - FC atm vs. atm Xray",111d,31410901,,70.0900000,,-2.9644895,0.0000000,NO,,0.4089771
KDVATDDDDAAK,ph,T,225,true,"TOR Kinase and ABA Receptor",100,29290610,XCorr,4.8681002,1.0000000,,,,3.251999942222E-6,
DVATDDDDAAK,ph,T,225,true,"STN8 phosphoproteome",38,21768351,"MASCOT Score",41.6400000,,,,,,0.0670950
