Peptide,PTM,ModifiedAA,ModifiedPosition,PeptideUniqueToGene,ExperimentDesc,ExpID,PubmedID,ScoreType,IdentScore,LocProb,Log2FChange,PQ-val,QuantSig,PEP,MassErrorPPM
ATETLELKTPQ,nt,A,2,true,"Arg/N-end rule seed, prt6 vs. Wt",99,29168982,"MASCOT Score",36.5700000,,,,,0.087679997086525,-1.6629194
ATETLELKTPQ,nta,A,2,true,"Arg/N-end rule seed, prt6 vs. Wt",99,29168982,"MASCOT Score",36.5700000,,-0.1622950,0.4643529,NO,0.087679997086525,-1.6629194
ATETLELKTPQLADTVAVTEKDTETK,ph,T,10,true,"Tissue atlas Arabidopsis - ProteomicsDB",114,32188942,"MaxQuant score",150.1800000,0.9999880,,,,0,
VKSPVTPVSERPIR,ph,S,52,true,"srk2dei ABA signaling phopshoproteomics",83,23572148,"MASCOT Score",41.0000000,,,,,,-0.0007000
VKSPVTPVSERPIR,ph,S,52,true,"atm and atr DNA damage response",88,25561503,"MASCOT Score",31.0000000,0.9990000,,,,,-0.5000000
VKSPVTPVSERPIR,ph,S,52,true,"Phospho cell culture sucrose/TOR",109,30833711,,,0.9999950,,,,,
VKSPVTPVSERPIR,ph,S,52,true,"Tissue atlas Arabidopsis - ProteomicsDB",114,32188942,"MaxQuant score",135.8100000,1.0000000,,,,9.090949788515E-6,
SPVTPVSERPIR,ph,S,52,true,"TOR Kinase and ABA Receptor",100,29290610,XCorr,2.2677977,0.9847000,,,,0.11789999902248,
VKSPVTPVSER,ph,S,52,true,"atm and atr DNA damage response",88,25561503,"MASCOT Score",43.0000000,1.0000000,,,,,-0.9000000
VKSPVTPVSERPIR,ph,T,55,true,"srk2dei ABA signaling phopshoproteomics",83,23572148,"MASCOT Score",40.0000000,,,,,,-0.0010000
SPVTPVSERPIR,ph,T,55,true,"atm and atr DNA damage response",88,25561503,"MASCOT Score",23.0000000,1.0000000,,,,,-1.1600000
SPVTPVSERPIR,ph,T,55,true,"Tissue atlas Arabidopsis - ProteomicsDB",114,32188942,"MaxQuant score",128.4600000,0.9999920,,,,1.5314199117711E-5,
VKSPVTPVSERPIR,ph,S,58,true,"atm and atr DNA damage response",88,25561503,"MASCOT Score",33.0000000,0.9930000,,,,,-0.5300000
YVIDTPPR,ph,T,75,true,"atm and atr DNA damage response",88,25561503,"MASCOT Score",37.0000000,1.0000000,,,,,-0.5500000
YVIDTPPR,ph,T,75,true,"TOR Kinase and ABA Receptor",100,29290610,XCorr,2.2748742,1.0000000,,,,0.0013660000404343,
YVIDTPPR,ph,T,75,true,"Tissue atlas Arabidopsis - ProteomicsDB",114,32188942,"MaxQuant score",142.9800000,1.0000000,,,,3.0519700100484E-9,
SSGNKPLSITQGR,ub,K,83,true,"Arabidopsis ubiquitination COFRADIC",40,26744219,"MaxQuant Score",64.1040000,1.0000000,,,,0.00028189999284223,1.5280000
DILLADSEK,ph,S,210,true,"Tissue atlas Arabidopsis - ProteomicsDB",114,32188942,"MaxQuant score",137.9300000,1.0000000,,,,2.9033599275863E-5,
DILLADSEKETKKR,ub,K,212,true,"Arabidopsis ubiquitination COFRADIC",40,26744219,"MaxQuant Score",136.3300000,1.0000000,,,,3.3850001349169E-20,0.8780000
DILLADSEKETKKR,ub,K,215,true,"Arabidopsis ubiquitination COFRADIC",40,26744219,"MaxQuant Score",121.9900000,0.9050000,,,,1.7079999173632E-17,1.4300000
KKSTSKNVTSGESSHVPAKR,ub,K,219,true,"Arabidopsis ubiquitination COFRADIC",40,26744219,"MaxQuant Score",79.4890000,0.8600000,,,,1.9660000319603E-17,-0.6540000
NVTSGESSHVPAKR,ph,S,231,true,"Tissue atlas Arabidopsis - ProteomicsDB",114,32188942,"MaxQuant score",129.8800000,0.9514200,,,,7.219399776659E-6,
NVTSGESSHVPAKR,ac,K,236,true,"Quantitative Acetylproteomics",101,29440448,,,,,,,,
SEDTETEDEKDK,ph,T,284,true,"atm and atr DNA damage response",88,25561503,"MASCOT Score",21.0000000,1.0000000,,,,,0.7700000
SEDTETEDEKDK,ph,T,286,true,"atm and atr DNA damage response",88,25561503,"MASCOT Score",21.0000000,1.0000000,,,,,0.7700000
DIITDAINEMSDDDDEKEEDTEDEGEK,ph,S,442,true,"srk2dei ABA signaling phopshoproteomics",83,23572148,"MASCOT Score",93.0000000,,,,,,-0.0012000
DIITDAINEMSDDDDEKEEDTEDEGEK,ph,S,442,true,"Brassinosteroid-Regulated Phosphorylation Dynamics",94,26187819,"MaxQuant Score",167.5100000,1.0000000,,,,1.5929999719496E-28,0.2000000
DIITDAINEMSDDDDEKEEDTEDEGEK,ph,S,442,true,"TOR Kinase and ABA Receptor",100,29290610,XCorr,4.2477722,1.0000000,,,,0.0014019999653101,
DIITDAINEMSDDDDEK,ph,S,442,true,"Chloroplast kinase substrates",60,19376835,"MASCOT Score",104.9500000,,,,,,-0.9845770
DIITDAINEMSDDDDEK,ph,S,442,true,"srk2dei ABA signaling phopshoproteomics",83,23572148,"MASCOT Score",97.0000000,,,,,,-0.0013000
DIITDAINEMSDDDDEK,ph,S,442,true,"TOR Kinase and ABA Receptor",100,29290610,XCorr,6.2618513,1.0000000,,,,1.6600000263267E-9,
DIITDAINEMSDDDDEK,ph,S,442,true,"Tissue atlas Arabidopsis - ProteomicsDB",114,32188942,"MaxQuant score",191.3500000,1.0000000,,,,1.5096496641833E-39,
DIITDAINEMSDDDDEKEEDTEDEGEK,ph,T,452,true,"srk2dei ABA signaling phopshoproteomics",83,23572148,"MASCOT Score",93.0000000,,,,,,-0.0012000
DIITDAINEMSDDDDEKEEDTEDEGEK,ph,T,452,true,"Brassinosteroid-Regulated Phosphorylation Dynamics",94,26187819,"MaxQuant Score",167.5100000,1.0000000,,,,1.5929999719496E-28,0.2000000
DIITDAINEMSDDDDEKEEDTEDEGEK,ph,T,452,true,"TOR Kinase and ABA Receptor",100,29290610,XCorr,4.2477722,1.0000000,,,,0.0014019999653101,
