Peptide,PTM,ModifiedAA,ModifiedPosition,PeptideUniqueToGene,ExperimentDesc,ExpID,PubmedID,ScoreType,IdentScore,LocProb,Log2FChange,PQ-val,QuantSig,PEP,MassErrorPPM
AAEAVAVATTETPKPKSQVTPSPDR,nt,A,27,true,"Arg/N-end rule pathway Roots",80,25728785,"MASCOT Score",65.2600000,,,,,1.597000050424E-6,
AAEAVAVATTETPKPKSQVTPSPDR,nt,A,27,true,"HUNTER N-terminome: legumain, GluC and trypsin",119,31951383,"MaxQuant score",56.9470000,,,,,,
AAEAVAVATTETPKPKSQVTPSPDR,nt,A,27,true,"Mitochondrial intermediate peptidases - icp55 / WT",131a,25732537,,97.7600000,,-0.0840443,,,,
AAEAVAVATTETPKPKSQVTPSPDR,nt,A,27,true,"Mitochondrial intermediate peptidases - oct1-1 / WT",131b,25732537,,85.2700000,,-1.1373079,,,,
AAEAVAVATTETPKPKSQVTPSPDR,nt,A,27,true,"Mitochondrial intermediate peptidases - oct1-2 / WT",131c,25732537,,83.2500000,,-0.5118586,,,,
AAEAVAVATTETPKPKSQVTPSPDR,nt,A,27,true,"Arabidopsis translation initiation landscape - NT",167b,35069635,,,,,,,,
AAEAVAVATTETPKPKSQVTPSPD,nt,A,27,true,"HUNTER N-terminome: legumain, GluC and trypsin",119,31951383,"MaxQuant score",126.9700000,,,,,,
AAEAVAVATTETPKPKSQVTPSPDR,nta,A,27,true,"FtsH12 N-terminome: WT / FtsH12 knockdown miRNA",118,33216923,"MaxQuant score",77.5220000,,,,,9.2700001466369E-25,
AEAVAVATTETPKPKSQVTPSPD,nt,A,28,true,"HUNTER N-terminome: legumain, GluC and trypsin",119,31951383,"MaxQuant score",83.2450000,,,,,,
SQVTPSPDRVK,ph,S,48,true,"atm and atr DNA damage response",88,25561503,"MASCOT Score",38.0000000,1.0000000,,,,,0.2200000
SQVTPSPDRVK,ph,S,48,true,"Tissue atlas Arabidopsis - ProteomicsDB",114,32188942,"MaxQuant score",162.1300000,0.9999780,,,,1.5636600347868E-10,
SQVTPSPDR,ph,S,48,true,"atm and atr DNA damage response",88,25561503,"MASCOT Score",36.0000000,0.9300000,,,,,-0.4600000
ITVGFCSNVQER,ox,C,114,false,"Redox kickstart of mitochondria",112,31871212,,,,-1.5396319,0.0081494,YES,,
CVVHAAWSSPTGLPAQTLIDR,ox,C,121,true,"Redox kickstart of mitochondria",112,31871212,,,,-0.4185532,0.0046327,YES,,
