Peptide,PTM,ModifiedAA,ModifiedPosition,PeptideUniqueToGene,ExperimentDesc,ExpID,PubmedID,ScoreType,IdentScore,LocProb,Log2FChange,PQ-val,QuantSig,PEP,MassErrorPPM
AVLNTTTNVTTTPSPTKPTKPETFISR,nt,A,64,true,"Stromal N-terminome",96,26371235,"MASCOT Score",34.3200000,,,,,,
VLNTTTNVTTTPSPTKPTKPETFISR,nt,V,65,true,"Arg/N-end rule pathway Roots",80,25728785,"MASCOT Score",38.1600000,,,,,0.00077440001768991,
VLNTTTNVTTTPSPTKPTKPETFISR,nt,V,65,true,"Stromal N-terminome",96,26371235,"MASCOT Score",43.9400000,,,,,,
VLNTTTNVTTTPSPTKPTKPE,nt,V,65,true,"Stromal N-terminome",96,26371235,"MASCOT Score",55.4700000,,,,,,
VLNTTTNVTTTPSPTKPTKPE,nt,V,65,true,"Arg/N-end rule seed, prt6 vs. Wt",99,29168982,"MASCOT Score",40.1400000,,0.2947040,0.0507104,NO,3.4869998444265E-8,4.2408111
VLNTTTNVTTTPSPTKPTKPE,nt,V,65,true,"HUNTER N-terminome: legumain, GluC and trypsin",119,31951383,"MaxQuant score",134.2900000,,,,,,
VLNTTTNVTTTPSPTKPTKPETFISR,nta,V,65,true,"HUNTER N-terminome: legumain, GluC and trypsin",119,31951383,"MaxQuant score",97.2330000,,,,,,
VLNTTTNVTTTPSPTKPTKPE,nta,V,65,true,"Arg/N-end rule seed, prt6 vs. Wt",99,29168982,"MASCOT Score",40.1400000,,0.0724575,0.5638969,NO,3.4869998444265E-8,4.2408111
VLNTTTNVTTTPSPTKPTKPE,nta,V,65,true,"HUNTER N-terminome: legumain, GluC and trypsin",119,31951383,"MaxQuant score",73.3150000,,,,,,
QGVETVFAYPGGASMEIHQALTR,nt,Q,110,true,"HUNTER N-terminome: legumain, GluC and trypsin",119,31951383,"MaxQuant score",45.0110000,,,,,,
MIGTDAFQETPIVEVTR,ph,T,203,true,"Phospho cell culture sucrose/TOR",109,30833711,,,0.9999660,,,,,
SITKHNYLVMDVEDIPR,nt,S,217,true,"Arabidopsis translation initiation landscape - NT",167b,35069635,,,,,,,,
KPVLYVGGGCLNSSDELGR,so,C,310,true,"Arabidopsis S-sulfenylation chemoproteomics",108,31578252,"pFind PSM Score",0.0000592,,2.4641600,,,,-1.1674481
TPHVSVCGDVK,sno,C,412,true,"Site-specific nitrosomeproteomic id - gsnor1-3",90a,25699590,XCorr,2.9337127,,,,,0.059089999645948,-7.0094396
TPHVSVCGDVK,sno,C,412,true,"hot5-4 / wildtype, FAT-switch S-nitrosoproteome",169,37277371,,,,-0.0106235,0.8678496,NO,,
TPHVSVCGDVK,so,C,412,true,"Arabidopsis S-sulfenylation chemoproteomics",108,31578252,"pFind PSM Score",0.0012307,,1.0488900,,,,1.0425084
TPHVSVCGDVK,so,C,412,true,"S-sulfenylation site detection using YAP1C",110,32714340,,,,,,,,
LALQGMNK,mox,M,422,true,"cat2 Methionine oxidation - 3h stress",62b,25693801,"MASCOT Score",33.0000000,,-0.2901931,,NO,,
NELNVQKQK,ac,K,448,true,"Quantitative Acetylproteomics",101,29440448,,,,,,,,
