Peptide,PTM,ModifiedAA,ModifiedPosition,PeptideUniqueToGene,ExperimentDesc,ExpID,PubmedID,ScoreType,IdentScore,LocProb,Log2FChange,PQ-val,QuantSig,PEP,MassErrorPPM
AVSEQSQDVFPWLK,nta,A,2,true,"Characterization plant N-terminal acetylation",6,22223895,"MASCOT Score",53.1900000,,,,,,
QQQIGFCPR,ox,C,106,true,"OxiTRAQ Arabidopsis - 5 mM H2O2 versus control",47,24376095,,,,0.8669843,0.0026737,YES,,
GSPVALLPQSSSDISVCSDLR,sno,C,456,true,"hot5-4 / wildtype, FAT-switch S-nitrosoproteome",169,37277371,,,,0.2683167,0.0025091,NO,,
DTQETLSDAER,ph,S,526,true,"atm and atr DNA damage response",88,25561503,"MASCOT Score",65.0000000,1.0000000,,,,,0.0700000
DTQETLSDAER,ph,S,526,true,"Phospho cell culture sucrose/TOR",109,30833711,,,0.9737150,,,,,
DTQETLSDAER,ph,S,526,true,"Tissue atlas Arabidopsis - ProteomicsDB",114,32188942,"MaxQuant score",185.5700000,0.9999220,,,,2.1815099775441E-14,
TSTTSPTIAHK,ph,S,634,true,"atm and atr DNA damage response",88,25561503,"MASCOT Score",35.0000000,0.9860000,,,,,0.3600000
TSTTSPTIAHK,ph,S,634,true,"Phospho cell culture sucrose/TOR",109,30833711,,,0.8484120,,,,,
TSTTSPTIAHK,ph,S,634,true,"Tissue atlas Arabidopsis - ProteomicsDB",114,32188942,"MaxQuant score",168.0200000,0.9945940,,,,1.8058100154095E-11,
DNDVLGMLASAYGDSSDSEEEDQK,ph,S,656,true,"srk2dei ABA signaling phopshoproteomics",83,23572148,"MASCOT Score",34.0000000,,,,,,0.0007000
DNDVLGMLASAYGDSSDSEEEDQK,ph,S,658,true,"srk2dei ABA signaling phopshoproteomics",83,23572148,"MASCOT Score",34.0000000,,,,,,0.0007000
GLVTPSSKGETK,ph,S,671,true,"Tissue atlas Arabidopsis - ProteomicsDB",114,32188942,"MaxQuant score",104.7000000,0.9268570,,,,0.00017853800090961,
TYDQEGSDGHEEARDGR,ph,S,683,true,"TOR Kinase and ABA Receptor",100,29290610,XCorr,3.5332007,1.0000000,,,,0.0016799999866635,
TYDQEGSDGHEEAR,ph,S,683,true,"SnRK2 protein kinase substrates",85,23776212,XCorr,3.2823379,1.0000000,,,,0.0044950698502362,
TYDQEGSDGHEEAR,ph,S,683,true,"atm and atr DNA damage response",88,25561503,"MASCOT Score",61.0000000,1.0000000,,,,,0.6100000
TYDQEGSDGHEEAR,ph,S,683,true,"TOR Kinase and ABA Receptor",100,29290610,XCorr,4.4739127,1.0000000,,,,2.7300001192998E-7,
TYDQEGSDGHEEAR,ph,S,683,true,"Tissue atlas Arabidopsis - ProteomicsDB",114,32188942,"MaxQuant score",223.1500000,1.0000000,,,,0,
SSPVASSPSKPK,ph,S,860,true,"Tissue atlas Arabidopsis - ProteomicsDB",114,32188942,"MaxQuant score",180.1700000,0.8524130,,,,2.1572699769382E-19,
SSPVASSPSKPK,ph,S,861,true,"atm and atr DNA damage response",88,25561503,"MASCOT Score",41.0000000,1.0000000,,,,,0.0200000
SSPVASSPSKPK,ph,S,861,true,"Tissue atlas Arabidopsis - ProteomicsDB",114,32188942,"MaxQuant score",180.6100000,0.9673760,,,,2.0564600539696E-19,
REDGVSDDTSEDHSYK,ph,S,969,true,"atm and atr DNA damage response",88,25561503,"MASCOT Score",43.0000000,1.0000000,,,,,0.2800000
REDGVSDDTSEDHSYK,ph,S,969,true,"TOR Kinase and ABA Receptor",100,29290610,XCorr,4.3466272,0.9941000,,,,0.00014550000196323,
EDGVSDDTSEDHSYK,ph,S,969,true,"Tissue atlas Arabidopsis - ProteomicsDB",114,32188942,"MaxQuant score",178.0300000,0.9999980,,,,6.3108399101138E-25,
REDGVSDDTSEDHSYK,ph,T,972,true,"atm and atr DNA damage response",88,25561503,"MASCOT Score",43.0000000,0.9990000,,,,,0.2800000
EDGVSDDTSEDHSYK,ph,T,972,true,"Tissue atlas Arabidopsis - ProteomicsDB",114,32188942,"MaxQuant score",110.2900000,0.9938620,,,,0.00013669100007974,
REDGVSDDTSEDHSYK,ph,S,973,true,"atm and atr DNA damage response",88,25561503,"MASCOT Score",43.0000000,0.9990000,,,,,0.2800000
REDGVSDDTSEDHSYK,ph,S,973,true,"TOR Kinase and ABA Receptor",100,29290610,XCorr,4.3466272,0.8292000,,,,0.00014550000196323,
EFESDDEVSDRSLGEEYTVR,ph,S,1025,true,"srk2dei ABA signaling phopshoproteomics",83,23572148,"MASCOT Score",53.0000000,,,,,,0.0009000
EFESDDEVSDRSLGEEYTVR,ph,S,1025,true,"Brassinosteroid-Regulated Phosphorylation Dynamics",94,26187819,"MaxQuant Score",129.2700000,1.0000000,,,,1.3490000096968E-21,0.5770000
EFESDDEVSDRSLGEEYTVR,ph,S,1025,true,"TOR Kinase and ABA Receptor",100,29290610,XCorr,4.5694089,1.0000000,,,,0.0010710000060499,
GYKEFESDDEVSDR,ph,S,1025,true,"Tissue atlas Arabidopsis - ProteomicsDB",114,32188942,"MaxQuant score",195.5500000,1.0000000,,,,9.2895498188845E-32,
EFESDDEVSDR,ph,S,1025,true,"STN8 phosphoproteome",38,21768351,"MASCOT Score",39.7300000,,,,,,
GYKEFESDDEVSDRSLGEEYTVR,ph,S,1030,true,"SnRK2 protein kinase substrates",85,23776212,XCorr,3.1748848,0.9960000,,,,0.012629699893296,
EFESDDEVSDRSLGEEYTVR,ph,S,1030,true,"srk2dei ABA signaling phopshoproteomics",83,23572148,"MASCOT Score",53.0000000,,,,,,0.0009000
EFESDDEVSDRSLGEEYTVR,ph,S,1030,true,"Brassinosteroid-Regulated Phosphorylation Dynamics",94,26187819,"MaxQuant Score",129.2700000,1.0000000,,,,1.3490000096968E-21,0.5770000
EFESDDEVSDRSLGEEYTVR,ph,S,1030,true,"TOR Kinase and ABA Receptor",100,29290610,XCorr,4.5694089,0.9998000,,,,0.0010710000060499,
GYKEFESDDEVSDR,ph,S,1030,true,"Tissue atlas Arabidopsis - ProteomicsDB",114,32188942,"MaxQuant score",195.5500000,1.0000000,,,,9.2895498188845E-32,
GYKEFESDDEVSDRSLGEEYTVR,ph,S,1033,true,"SnRK2 protein kinase substrates",85,23776212,XCorr,3.1748848,0.9890000,,,,0.012629699893296,
EFESDDEVSDRSLGEEYTVR,ph,S,1033,true,"srk2dei ABA signaling phopshoproteomics",83,23572148,"MASCOT Score",53.0000000,,,,,,0.0009000
EFESDDEVSDRSLGEEYTVR,ph,S,1033,true,"Brassinosteroid-Regulated Phosphorylation Dynamics",94,26187819,"MaxQuant Score",129.2700000,1.0000000,,,,1.3490000096968E-21,0.5770000
EFESDDEVSDRSLGEEYTVR,ph,S,1033,true,"TOR Kinase and ABA Receptor",100,29290610,XCorr,4.5694089,0.9936000,,,,0.0010710000060499,
SLGEEYTVR,ph,S,1033,true,"STN8 phosphoproteome",38,21768351,"MASCOT Score",68.2900000,,,,,,0.2173810
SLGEEYTVR,ph,S,1033,true,"LAXIC - mannitol vs control",84b,23660473,XCorr,2.2200000,1.0000000,,,,0.15885999798775,
SLGEEYTVR,ph,S,1033,true,"Tissue atlas Arabidopsis - ProteomicsDB",114,32188942,"MaxQuant score",171.8700000,1.0000000,,,,5.3960699005984E-5,
GYKEFESDDEVSDRSLGEEYTVR,ph,Y,1038,true,"SnRK2 protein kinase substrates",85,23776212,XCorr,2.3613408,0.7510000,,,,2.0708299416583E-5,
GYKEFESDDEVSDRSLGEEYTVR,ph,T,1039,true,"SnRK2 protein kinase substrates",85,23776212,XCorr,2.3613408,0.7510000,,,,2.0708299416583E-5,
NPVSYESEDNGVYQQSGR,ph,S,1089,true,"atm and atr DNA damage response",88,25561503,"MASCOT Score",53.0000000,0.9580000,,,,,0.1200000
NPVSYESEDNGVYQQSGR,ph,S,1089,true,"Tissue atlas Arabidopsis - ProteomicsDB",114,32188942,"MaxQuant score",206.1800000,0.9999980,,,,0,
VFRNPVSYESEDNGVYQQSGR,ph,S,1092,true,"Brassinosteroid-Regulated Phosphorylation Dynamics",94,26187819,"MaxQuant Score",157.9000000,1.0000000,,,,5.2710000427539E-20,1.2810000
VFRNPVSYESEDNGVYQQSGR,ph,S,1092,true,"TOR Kinase and ABA Receptor",100,29290610,XCorr,3.3220212,0.9740000,,,,0.019509999081492,
NPVSYESEDNGVYQQSGR,ph,S,1092,true,"Tyrosine phosphorylation in Arabidopsis",59,18463617,"MASCOT Score",47.0000000,,,,,,-2.5144187
NPVSYESEDNGVYQQSGR,ph,S,1092,true,"srk2dei ABA signaling phopshoproteomics",83,23572148,"MASCOT Score",90.0000000,,,,,,-0.0018000
NPVSYESEDNGVYQQSGR,ph,S,1092,true,"SnRK2 protein kinase substrates",85,23776212,XCorr,3.9830601,1.0000000,,,,1.155940026365E-5,
NPVSYESEDNGVYQQSGR,ph,S,1092,true,"atm and atr DNA damage response",88,25561503,"MASCOT Score",53.0000000,0.9580000,,,,,0.1200000
NPVSYESEDNGVYQQSGR,ph,S,1092,true,"TOR Kinase and ABA Receptor",100,29290610,XCorr,5.7565751,0.9993000,,,,1.7290000542403E-9,
NPVSYESEDNGVYQQSGR,ph,S,1092,true,"Lateral root-induction - NAA vs control",106,23328941,"MASCOT Score",38.0000000,,,,,,
NPVSYESEDNGVYQQSGR,ph,S,1092,true,"Phospho cell culture sucrose/TOR",109,30833711,,,1.0000000,,,,,
NPVSYESEDNGVYQQSGR,ph,S,1092,true,"Col-0 callus - FC Col-0 vs. Col-0 Xray",111a,31410901,,69.5500000,,-2.0030401,0.0000000,NO,,1.0486371
NPVSYESEDNGVYQQSGR,ph,S,1092,true,"Col-0 X-ray callus - FC Col-0 vs. Col-0 Xray",111b,31410901,,69.5500000,,-2.0030401,0.0000000,NO,,1.0486371
NPVSYESEDNGVYQQSGR,ph,S,1092,true,"atm callus - FC atm vs. atm Xray",111c,31410901,,69.5500000,,,0.0000000,NO,,1.0486371
NPVSYESEDNGVYQQSGR,ph,S,1092,true,"Tissue atlas Arabidopsis - ProteomicsDB",114,32188942,"MaxQuant score",481.1600000,1.0000000,,,,0,
MVGEYDSAENSLEER,ph,Y,1118,true,"srk2dei ABA signaling phopshoproteomics",83,23572148,"MASCOT Score",40.0000000,,,,,,-0.0010000
MVGEYDSAENSLEER,ph,S,1120,true,"Tyrosine phosphorylation in Arabidopsis",59,18463617,"MASCOT Score",62.0000000,,,,,,-0.7191475
MVGEYDSAENSLEER,ph,S,1120,true,"srk2dei ABA signaling phopshoproteomics",83,23572148,"MASCOT Score",30.0000000,,,,,,-0.0008000
MVGEYDSAENSLEER,ph,S,1120,true,"LAXIC - mannitol vs control",84b,23660473,XCorr,5.2800000,1.0000000,,,,1.3400000553609E-10,
MVGEYDSAENSLEER,ph,S,1120,true,"SnRK2 protein kinase substrates",85,23776212,XCorr,5.0151153,1.0000000,,,,0.0011467499425635,
MVGEYDSAENSLEER,ph,S,1120,true,"atm and atr DNA damage response",88,25561503,"MASCOT Score",71.0000000,0.9940000,,,,,-0.3900000
MVGEYDSAENSLEER,ph,S,1120,true,"TOR Kinase and ABA Receptor",100,29290610,XCorr,4.8113127,0.9176000,,,,9.3500000275526E-7,
MVGEYDSAENSLEER,ph,S,1120,true,"Phospho cell culture sucrose/TOR",109,30833711,,,1.0000000,,,,,
MVGEYDSAENSLEER,ph,S,1120,true,"Tissue atlas Arabidopsis - ProteomicsDB",114,32188942,"MaxQuant score",243.1700000,1.0000000,,,,0,
MVGEYDSAENSLEER,ph,S,1124,true,"srk2dei ABA signaling phopshoproteomics",83,23572148,"MASCOT Score",40.0000000,,,,,,-0.0010000
MVGEYDSAENSLEER,ph,S,1124,true,"LAXIC - mannitol vs control",84b,23660473,XCorr,5.2800000,1.0000000,,,,1.3400000553609E-10,
MVGEYDSAENSLEER,ph,S,1124,true,"SnRK2 protein kinase substrates",85,23776212,XCorr,5.0151153,1.0000000,,,,0.0011467499425635,
MVGEYDSAENSLEER,ph,S,1124,true,"atm and atr DNA damage response",88,25561503,"MASCOT Score",71.0000000,1.0000000,,,,,-0.3900000
MVGEYDSAENSLEER,ph,S,1124,true,"TOR Kinase and ABA Receptor",100,29290610,XCorr,4.8113127,1.0000000,,,,9.3500000275526E-7,
MVGEYDSAENSLEER,ph,S,1124,true,"Tissue atlas Arabidopsis - ProteomicsDB",114,32188942,"MaxQuant score",243.1700000,1.0000000,,,,0,
FLQEFASGKK,ph,S,1167,true,"Tissue atlas Arabidopsis - ProteomicsDB",114,32188942,"MaxQuant score",98.4060000,1.0000000,,,,0.00036302299122326,
KNEELDSYMEGPSTR,ph,S,1176,true,"Tissue atlas Arabidopsis - ProteomicsDB",114,32188942,"MaxQuant score",103.0400000,0.9993750,,,,1.1808700037363E-5,
