Peptide,PTM,ModifiedAA,ModifiedPosition,PeptideUniqueToGene,ExperimentDesc,ExpID,PubmedID,ScoreType,IdentScore,LocProb,Log2FChange,PQ-val,QuantSig,PEP,MassErrorPPM
QLFIGGQWTEPVLR,nt,Q,9,true,"HUNTER N-terminome: legumain, GluC and trypsin",119,31951383,"MaxQuant score",109.6000000,,,,,,
AIAAKVIER,ac,K,84,true,"Quantitative Acetylproteomics",101,29440448,,,,,,,,
AIAAKVIER,ub,K,84,true,"Arabidopsis ubiquitination COFRADIC",40,26744219,"MaxQuant Score",71.4510000,1.0000000,,,,0.010999999940395,0.4650000
TPLSLPMDTFK,mox,M,140,true,"cat2 Methionine oxidation - 3h stress",62b,25693801,"MASCOT Score",34.0000000,,-0.3081308,,NO,,
LVKPVSLELGGK,ph,S,258,true,"atm and atr DNA damage response",88,25561503,"MASCOT Score",29.0000000,1.0000000,,,,,-2.9200000
ISDPFEEGCR,ox,C,331,true,"SPEAR - 10 mM H2O2 / mock",138a,34619326,,,,5.3448173,0.0001694,YES,,
ISDPFEEGCR,ox,C,331,true,"SPEAR - 50 mM H2O2 / mock",138b,34619326,,,,4.7228698,0.0158068,YES,,
ISDPFEEGCR,sno,C,331,true,"Site-specific nitrosomeproteomic id - gsnor1-3",90a,25699590,XCorr,2.2255335,,,,,0.00020179999410175,-6.4183265
ISDPFEEGCR,sno,C,331,true,"Site-specific nitrosomeproteomic id - gsnor1-3",90b,25699590,XCorr,2.1200000,,,,,0.097589999437332,-6.8000000
ISDPFEEGCR,so,C,331,true,"S-sulfenylation site detection using YAP1C",110,32714340,,,,,,,,
NEGATVLCGGVRPEHLK,ox,C,361,true,"SPEAR - 10 mM H2O2 / mock",138a,34619326,,,,2.8543660,0.0403033,YES,,
NEGATVLCGGVRPEHLK,sno,C,361,true,"hot5-4 / wildtype, FAT-switch S-nitrosoproteome",169,37277371,,,,,,,,
NEGATVLCGGVRPEHLK,so,C,361,true,"Arabidopsis S-sulfenylation chemoproteomics",108,31578252,"pFind PSM Score",0.0090287,,1.4806400,,,,-0.2685943
EEVFGPALCVK,sno,C,400,true,"hot5-4 / wildtype, FAT-switch S-nitrosoproteome",169,37277371,,,,0.1369203,0.7415900,NO,,
