Peptide,PTM,ModifiedAA,ModifiedPosition,PeptideUniqueToGene,ExperimentDesc,ExpID,PubmedID,ScoreType,IdentScore,LocProb,Log2FChange,PQ-val,QuantSig,PEP,MassErrorPPM
VLVLALGDLHVPHR,nt,V,2,true,"Arg/N-end rule pathway Roots",80,25728785,"MASCOT Score",54.5000000,,,,,7.4989998211095E-7,
VLVLALGDLHVPHR,nt,V,2,true,"Tic56 chloroplast import - ppi2",89b,25588737,XCorr,3.5267754,,,,,,
VLVLALGDLHVPHR,nt,V,2,true,"N-terminal ChaFRADIC",92,26010716,"MASCOT Score",65.5300000,,,,,1.2709999719362E-10,
VLVLALGDLHVPHR,nt,V,2,true,"HUNTER N-terminome: legumain, GluC and trypsin",119,31951383,"MaxQuant score",67.9970000,,,,,,
VLVLALGD,nt,V,2,true,"N-terminal ChaFRADIC",92,26010716,"MASCOT Score",47.4100000,,,,,0.010990000329912,
VLVLALGD,nt,V,2,true,"HUNTER N-terminome: legumain, GluC and trypsin",119,31951383,"MaxQuant score",86.3440000,,,,,,
TICPDLHIVR,sno,C,54,true,"Site-specific nitrosomeproteomic id - gsnor1-3",90a,25699590,XCorr,2.1285067,,,,,0.00060959998518229,-5.6430132
TICPDLHIVR,sno,C,54,true,"Site-specific nitrosomeproteomic id - gsnor1-3",90b,25699590,XCorr,2.2100000,,,,,0.028030000627041,-7.2300000
TICPDLHIVR,so,C,54,true,"Arabidopsis S-sulfenylation chemoproteomics",108,31578252,"pFind PSM Score",0.1228510,,0.8283800,,,,-1.5822390
TICPDLHIVR,so,C,54,true,"S-sulfenylation site detection using YAP1C",110,32714340,,,,,,,,
