Peptide,PTM,ModifiedAA,ModifiedPosition,PeptideUniqueToGene,ExperimentDesc,ExpID,PubmedID,ScoreType,IdentScore,LocProb,Log2FChange,PQ-val,QuantSig,PEP,MassErrorPPM
FNSVPSFTGLK,ph,S,38,true,"Tissue atlas Arabidopsis - ProteomicsDB",114,32188942,"MaxQuant score",145.2900000,0.9500390,,,,3.9089400161174E-8,
HLYDIANVKGVAADLSHCNTPSQVR,nt,H,112,true,"FtsH12 N-terminome: WT / FtsH12 knockdown miRNA",118,33216923,"MaxQuant score",46.1590000,,,,,0.0050622997805476,
GVAADLSHCNTPSQVR,ox,C,129,true,"OxiTRAQ Arabidopsis - 5 mM H2O2 versus control",47,24376095,,,,-0.2317614,0.0379219,NO,,
GVAADLSHCNTPSQVR,sno,C,129,true,"Site-specific nitrosomeproteomic id - gsnor1-3",90a,25699590,XCorr,3.5360932,,,,,4.6529999053746E-6,-5.3429329
GVAADLSHCNTPSQVR,sno,C,129,true,"Site-specific nitrosomeproteomic id - gsnor1-3",90b,25699590,XCorr,4.0100000,,,,,6.9900002017675E-6,-4.7600000
GVAADLSHCNTPSQVR,sno,C,129,true,"hot5-4 / wildtype, FAT-switch S-nitrosoproteome",169,37277371,,,,0.1096613,0.7861079,NO,,
GVAADLSHCNTPSQVR,so,C,129,true,"Arabidopsis S-sulfenylation chemoproteomics",108,31578252,"pFind PSM Score",0.0015507,,1.0529100,,,,1.1399985
GVAADLSHCNTPSQVR,so,C,129,true,"S-sulfenylation site detection using YAP1C",110,32714340,,,,,,,,
DFTGPSELADCLK,ph,S,142,true,"Tissue atlas Arabidopsis - ProteomicsDB",114,32188942,"MaxQuant score",120.2100000,0.9999950,,,,6.5013999119401E-5,
DFTGPSELADCLK,sno,C,147,true,"hot5-4 / wildtype, FAT-switch S-nitrosoproteome",169,37277371,,,,0.1103542,0.2694083,NO,,
DFTGPSELADCLKDVNVVVIPAGVPR,so,C,147,true,"S-sulfenylation site detection using YAP1C",110,32714340,,,,,,,,
KLFGVTTLDVVR,cr,K,223,false,"Open search Plant PTM Viewer 2.0 - Crotonylation",164c,TBA,,,,,,,,
GVTTLDVVR,nt,G,226,false,"Arabidopsis translation initiation landscape - NT",167b,35069635,,,,,,,,
VTTLDVVR,nt,V,227,false,"Arg/N-end rule seed, prt6 vs. Wt",99,29168982,"MASCOT Score",40.3100000,,,,,0.076310001313686,-1.0824135
IQNAGTEVVDAK,ph,T,293,true,"Phospho cell culture sucrose/TOR",109,30833711,,,1.0000000,,,,,
AGAGSATLSMAYAAAR,ph,S,304,true,"Tissue atlas Arabidopsis - ProteomicsDB",114,32188942,"MaxQuant score",143.9700000,0.9996760,,,,2.4672899834322E-10,
SSLRALDGDGDVYE,nt,S,319,true,"N-terminal ChaFRADIC",92,26010716,"MASCOT Score",30.9000000,,,,,7.1360000220011E-7,
SDLQGLTEYE,nt,S,363,true,"N-terminal ChaFRADIC",92,26010716,"MASCOT Score",34.7800000,,,,,0.0049220002256334,
