Peptide,PTM,ModifiedAA,ModifiedPosition,PeptideUniqueToGene,ExperimentDesc,ExpID,PubmedID,ScoreType,IdentScore,LocProb,Log2FChange,PQ-val,QuantSig,PEP,MassErrorPPM
VSSLLMSFAPATVR,ph,T,13,true,"Tissue atlas Arabidopsis - ProteomicsDB",114,32188942,"MaxQuant score",103.6100000,0.9998040,,,,9.5238101494033E-5,
ATSTKGGSGGPKEEKNPI,nt,A,18,true,"Arabidopsis translation initiation landscape - NT",167b,35069635,,,,,,,,
VYATSTKGGSGGPK,ph,T,21,true,"atm and atr DNA damage response",88,25561503,"MASCOT Score",21.0000000,1.0000000,,,,,-2.3400000
VYATSTKGGSGGPK,ph,T,21,true,"Tissue atlas Arabidopsis - ProteomicsDB",114,32188942,"MaxQuant score",77.7760000,0.8067130,,,,0.0030468399636447,
GGSGGPKEEKNPIDFVLGFMTK,ph,S,25,true,"STN8 phosphoproteome",38,21768351,"MASCOT Score",64.0400000,,,,,,
GGSGGPKEEKNPIDFVLGFMTK,ph,S,25,true,"Chloroplast kinase substrates",60,19376835,"MASCOT Score",55.6700000,,,,,,-0.8041570
GGSGGPKEEKNPIDFVLGFMTK,ph,S,25,true,"Touch-induced phosphorylation: 40s touch vs untouc",136,30291188,"MASCOT score",62.7700000,,-0.6982944,0.3697345,NO,,-3.0364335
GGSGGPKEEK,ph,S,25,true,"atm and atr DNA damage response",88,25561503,"MASCOT Score",41.0000000,1.0000000,,,,,-2.1300000
TKQDQFYETNPLLKKVDEKEGTTTGGR,nt,T,43,true,"Stromal N-terminome",96,26371235,"MASCOT Score",32.7800000,,,,,,
QDQFYETNPLLKK,ac,K,56,true,"Histone deacetylases substrates - hda14 vs WT",98e,29061669,"MaxQuant Score",92.2000000,1.0000000,-0.4930000,0.9099133,NO,3.0000001061126E-7,
KVDEKEGTTTGGR,ac,K,61,true,"Histone deacetylases substrates - hda14 vs WT",98e,29061669,"MaxQuant Score",81.0000000,0.8350000,-1.5940000,0.1282331,NO,6.7000000854023E-6,
VDEKEGTTTGGRGTVR,ph,T,64,true,"atm and atr DNA damage response",88,25561503,"MASCOT Score",32.0000000,1.0000000,,,,,-0.6100000
VDEKEGTTTGGRGTVR,ph,T,64,true,"Protein sumoylation and phosphorylation cross-talk",97,28419593,,,,,,,,
KVDEKEGTTTGGR,ph,T,64,true,"atm and atr DNA damage response",88,25561503,"MASCOT Score",46.0000000,0.9950000,,,,,-1.5200000
EGTTTGGRGTVR,ph,T,64,true,"STN8 phosphoproteome",38,21768351,"MASCOT Score",47.7200000,,,,,,
EGTTTGGRGTVR,ph,T,64,true,"Chloroplast kinase substrates",60,19376835,"MASCOT Score",41.2300000,,,,,,-1.2564300
EGTTTGGRGTVR,ph,T,64,true,"atm and atr DNA damage response",88,25561503,"MASCOT Score",46.0000000,0.9930000,,,,,0.3000000
EGTTTGGRGTVR,ph,T,64,true,"Tissue atlas Arabidopsis - ProteomicsDB",114,32188942,"MaxQuant score",167.6900000,0.9948780,,,,1.1013400478058E-12,
VDEKEGTTTGGR,ph,T,64,true,"atm and atr DNA damage response",88,25561503,"MASCOT Score",48.0000000,0.9020000,,,,,-0.3900000
VDEKEGTTTGGR,ph,T,64,true,"Protein sumoylation and phosphorylation cross-talk",97,28419593,,,,,,,,
VDEKEGTTTGGRGTVR,ph,T,65,true,"atm and atr DNA damage response",88,25561503,"MASCOT Score",32.0000000,1.0000000,,,,,-0.6100000
KVDEKEGTTTGGR,ph,T,65,true,"atm and atr DNA damage response",88,25561503,"MASCOT Score",46.0000000,0.9350000,,,,,-1.5200000
KVDEKEGTTTGGR,ph,T,65,true,"Protein sumoylation and phosphorylation cross-talk",97,28419593,,,,,,,,
VDEKEGTTTGGR,ph,T,65,true,"atm and atr DNA damage response",88,25561503,"MASCOT Score",41.0000000,0.9920000,,,,,-0.6000000
KVDEKEGTTTGGRGTVR,ph,T,66,true,"Protein sumoylation and phosphorylation cross-talk",97,28419593,,,,,,,,
VDEKEGTTTGGRGTVR,ph,T,71,true,"atm and atr DNA damage response",88,25561503,"MASCOT Score",32.0000000,1.0000000,,,,,-0.6100000
VDEKEGTTTGGRGTVR,ph,T,71,true,"Protein sumoylation and phosphorylation cross-talk",97,28419593,,,,,,,,
EGTTTGGRGTVR,ph,T,71,true,"Chloroplast kinase substrates",60,19376835,"MASCOT Score",42.7500000,,,,,,-0.5684050
EGTTTGGRGTVR,ph,T,71,true,"atm and atr DNA damage response",88,25561503,"MASCOT Score",46.0000000,1.0000000,,,,,0.3000000
EGTTTGGRGTVR,ph,T,71,true,"TOR Kinase and ABA Receptor",100,29290610,XCorr,2.8581257,1.0000000,,,,0.0024639999028295,
EGTTTGGRGTVR,ph,T,71,true,"Tissue atlas Arabidopsis - ProteomicsDB",114,32188942,"MaxQuant score",144.1600000,0.9996060,,,,1.6542800551633E-7,
GGKNSAPTPVPK,ac,K,76,true,"Quantitative Acetylproteomics",101,29440448,,,,,,,,
GGKNSAPTPVPK,ph,S,78,true,"atm and atr DNA damage response",88,25561503,"MASCOT Score",37.0000000,1.0000000,,,,,-1.6700000
GGKNSAPTPVPK,ph,S,78,true,"Tissue atlas Arabidopsis - ProteomicsDB",114,32188942,"MaxQuant score",99.8440000,0.9994500,,,,0.00024751300225034,
NSAPTPVPKK,ac,K,85,true,"Quantitative Acetylproteomics",101,29440448,,,,,,,,
KSEGGFGGLGSLFK,ph,S,87,true,"atm and atr DNA damage response",88,25561503,"MASCOT Score",70.0000000,1.0000000,,,,,-1.9600000
KSEGGFGGLGSLFKK,ph,S,96,true,"Chloroplast kinase substrates",60,19376835,"MASCOT Score",38.9200000,,,,,,0.3256910
KSEGGFGGLGSLFK,ph,S,96,true,"atm and atr DNA damage response",88,25561503,"MASCOT Score",65.0000000,1.0000000,,,,,-4.8600000
KSEGGFGGLGSLFKK,ac,K,99,true,"Quantitative Acetylproteomics",101,29440448,,,,,,,,
SEGGFGGLGSLFKK,ac,K,99,true,"Histone deacetylases - apicidin vs control",98a,29061669,"MaxQuant Score",120.9000000,1.0000000,0.0110000,0.9727472,NO,7.6999997632339E-14,
SEGGFGGLGSLFKK,ac,K,99,true,"Histone deacetylases substrates - TSA vs control",98b,29061669,"MaxQuant Score",120.9000000,1.0000000,2.3010000,0.4819478,NO,7.6999997632339E-14,
SEGGFGGLGSLFKK,ac,K,99,true,"Histone deacetylases - hda14 vs WT (thylakoids)",98d,29061669,"MaxQuant Score",122.0000000,1.0000000,0.1410000,0.9749896,NO,9.9000002640182E-11,
SEGGFGGLGSLFKK,ac,K,99,true,"Quantitative Acetylproteomics",101,29440448,,,,,,,,
