Peptide,PTM,ModifiedAA,ModifiedPosition,PeptideUniqueToGene,ExperimentDesc,ExpID,PubmedID,ScoreType,IdentScore,LocProb,Log2FChange,PQ-val,QuantSig,PEP,MassErrorPPM
ANANGKAATSLPE,nt,A,2,true,"N-terminal ChaFRADIC",92,26010716,"MASCOT Score",50.0800000,,,,,0.0024319998919964,
ANANGKAATSLPE,nt,A,2,true,"Arg/N-end rule seed, prt6 vs. Wt",99,29168982,"MASCOT Score",54.1000000,,,,,0.0010400000028312,4.4643922
ANANGKAATSLPE,nta,A,2,true,"N-terminal ChaFRADIC",92,26010716,"MASCOT Score",50.0800000,,,,,0.0024319998919964,
ANANGKAATSLPE,nta,A,2,true,"Arg/N-end rule seed, prt6 vs. Wt",99,29168982,"MASCOT Score",54.1000000,,-0.1323755,0.3118577,NO,0.0010400000028312,4.4643922
AATSLPEKISAK,ub,K,15,true,"upl3 mutant / wildtype",168,35926874,"MaxQuant score",86.9110000,1.0000000,-0.5332424,0.4237600,NO,9.9443197541405E-5,0.4482700
YSPHFSPLK,ph,Y,40,true,"atm and atr DNA damage response",88,25561503,"MASCOT Score",28.0000000,0.8610000,,,,,-0.3400000
YSPHFSPLK,ph,S,41,true,"Tissue atlas Arabidopsis - ProteomicsDB",114,32188942,"MaxQuant score",123.9600000,1.0000000,,,,0.00011388800339773,
FFGKVQVNPDGSR,ac,K,208,true,"Quantitative Acetylproteomics",101,29440448,,,,,,,,
FFGKVQVNPDGSR,ub,K,208,true,"upl3 mutant / wildtype",168,35926874,"MaxQuant score",80.3100000,1.0000000,0.0648829,0.9551800,NO,7.5501797255129E-5,0.3074500
AQQICTVLYPGDATENGK,sno,C,281,true,"Site-specific nitrosomeproteomic id - gsnor1-3",90a,25699590,XCorr,3.4775443,,,,,4.1090002014244E-6,-4.6927996
AQQICTVLYPGDATENGK,sno,C,281,true,"Site-specific nitrosomeproteomic id - gsnor1-3",90b,25699590,XCorr,3.4400000,,,,,0.023429999127984,-6.3500000
KWSEFPSK,ub,K,327,true,"upl3 mutant / wildtype",168,35926874,"MaxQuant score",120.3100000,1.0000000,0.2939590,,,0.011165300384164,1.3242000
HMEIIEEIDKR,ac,K,410,true,"Quantitative Acetylproteomics",101,29440448,,,,,,,,
ISSLSILDNNPQKPVVR,ub,K,439,true,"upl3 mutant / wildtype",168,35926874,"MaxQuant score",124.6200000,1.0000000,-0.5691795,0.1051160,NO,4.6800202602171E-10,1.0602000
FCSPELSDIITK,sno,C,498,true,"Site-specific nitrosomeproteomic id - gsnor1-3",90a,25699590,XCorr,2.8547273,,,,,2.9949999316159E-6,-6.3249326
FCSPELSDIITK,sno,C,498,true,"Site-specific nitrosomeproteomic id - gsnor1-3",90b,25699590,XCorr,2.8300000,,,,,0.064980000257492,-6.3200000
FCSPELSDIITK,sno,C,498,true,"hot5-4 / wildtype, FAT-switch S-nitrosoproteome",169,37277371,,,,,,,,
QFADNEELQSEWASAKTANKKR,nt,Q,527,true,"HUNTER N-terminome: legumain, GluC and trypsin",119,31951383,"MaxQuant score",91.6370000,,,,,,
QLMNILGVVYR,nt,Q,580,true,"HUNTER N-terminome: legumain, GluC and trypsin",119,31951383,"MaxQuant score",71.2230000,,,,,,
TVPRTVMIGGK,mox,M,611,true,"cat2 Methionine oxidation - 3h stress",62b,25693801,"MASCOT Score",57.0000000,,0.6638808,,NO,,
EREDGLFKPDPR,ub,K,738,true,"upl3 mutant / wildtype",168,35926874,"MaxQuant score",58.1720000,1.0000000,-0.1584294,,,0.0013958100462332,-0.1303500
EIWNIEACPVP,ox,C,838,true,"SPEAR - 10 mM H2O2 / mock",138a,34619326,,,,3.6962305,0.0003552,YES,,
EIWNIEACPVP,ox,C,838,true,"SPEAR - 50 mM H2O2 / mock",138b,34619326,,,,3.9346329,0.0000060,YES,,
