Peptide,PTM,ModifiedAA,ModifiedPosition,PeptideUniqueToGene,ExperimentDesc,ExpID,PubmedID,ScoreType,IdentScore,LocProb,Log2FChange,PQ-val,QuantSig,PEP,MassErrorPPM
AKQTAFQLGKTKGDDDSE,nt,A,31,true,"HUNTER N-terminome: legumain, GluC and trypsin",119,31951383,"MaxQuant score",88.5510000,,,,,,
KQTAFQLGKTKGDDDSE,nt,K,32,true,"HUNTER N-terminome: legumain, GluC and trypsin",119,31951383,"MaxQuant score",65.9430000,,,,,,
KQTAFQLGKTKGDDDSE,nta,K,32,true,"HUNTER N-terminome: legumain, GluC and trypsin",119,31951383,"MaxQuant score",,,,,,,
KQTAFQLGKTKGDDD,nta,K,32,true,"HUNTER N-terminome: legumain, GluC and trypsin",119,31951383,"MaxQuant score",,,,,,,
TKGDDDSEGK,ph,T,41,true,"atm and atr DNA damage response",88,25561503,"MASCOT Score",36.0000000,1.0000000,,,,,-0.6500000
TKGDDDSEGKQK,ac,K,50,true,"Quantitative Acetylproteomics",101,29440448,,,,,,,,
VAATYKILSNDEVK,ac,K,139,true,"Histone deacetylases - hda14 vs WT (thylakoids)",98d,29061669,"MaxQuant Score",44.4000000,1.0000000,0.0010000,0.9977001,NO,0.0080000003799796,
ILSNDEVKR,ac,K,147,true,"Histone deacetylases - apicidin vs control",98a,29061669,"MaxQuant Score",77.7000000,1.0000000,0.0100000,0.9727472,NO,0.010999999940395,
ILSNDEVKR,ac,K,147,true,"Quantitative Acetylproteomics",101,29440448,,,,,,,,
LNAVQSPFQDAESIAKAIGNATK,ac,K,164,true,"Histone deacetylases - hda14 vs WT (thylakoids)",98d,29061669,"MaxQuant Score",78.1000000,1.0000000,0.7080000,0.8830799,NO,6.8399997579967E-14,
SQPLTISDLIEK,ph,S,237,true,"atm and atr DNA damage response",88,25561503,"MASCOT Score",54.0000000,1.0000000,,,,,1.4800000
VAQTDVAYTLIKTSLTEDFSPEK,ac,K,260,true,"Histone deacetylases - hda14 vs WT (thylakoids)",98d,29061669,"MaxQuant Score",135.8000000,1.0000000,0.2020000,0.9571941,NO,3.3800001310889E-29,
TSLTEDFSPEK,ph,S,268,true,"Tissue atlas Arabidopsis - ProteomicsDB",114,32188942,"MaxQuant score",112.4400000,1.0000000,,,,3.1955700251274E-5,
VAADKAR,ac,K,368,true,"Quantitative Acetylproteomics",101,29440448,,,,,,,,
EAAEAAKEFEK,ac,K,377,true,"Histone deacetylases - apicidin vs control",98a,29061669,"MaxQuant Score",44.5000000,1.0000000,0.0720000,0.8629785,NO,0.017000000923872,
EAAEAAKEFEK,ac,K,377,true,"Quantitative Acetylproteomics",101,29440448,,,,,,,,
EFEKQMQK,ac,K,381,true,"Histone deacetylases - apicidin vs control",98a,29061669,"MaxQuant Score",84.0000000,1.0000000,-0.1000000,0.5984116,NO,0.017000000923872,
LSEKEAEAASLAEDAQQKADAVGVTVDGLFNK,ph,S,387,true,"MAPK Arabidopsis substrates",45,23172892,"MaxQuant Score",49.5590000,,,,,,
LSEKEAEAASLAEDAQQK,ac,K,389,true,"Histone deacetylases - apicidin vs control",98a,29061669,"MaxQuant Score",79.5000000,1.0000000,-0.1090000,0.5058247,NO,2.2000000779454E-11,
LSEKEAEAASLAEDAQQK,ac,K,389,true,"Histone deacetylases - hda14 vs WT (thylakoids)",98d,29061669,"MaxQuant Score",91.4000000,1.0000000,0.7910000,0.5495409,NO,8.6599998005976E-13,
LSEKEAEAASLAEDAQQK,ac,K,389,true,"Histone deacetylases substrates - hda14 vs WT",98e,29061669,"MaxQuant Score",60.3000000,1.0000000,1.3110000,0.0794328,NO,3.9999998989515E-5,
LSEKEAEAASLAEDAQQKADAVGVTVDGLFNK,ph,S,395,true,"MAPK Arabidopsis substrates",45,23172892,"MaxQuant Score",116.2000000,,,,,,
LSEKEAEAASLAEDAQQK,ph,S,395,true,"Protein sumoylation and phosphorylation cross-talk",97,28419593,,,,,,,,
LSEKEAEAASLAEDAQQK,ph,S,395,true,"Touch-induced phosphorylation: 40s touch vs untouc",136,30291188,"MASCOT score",106.2200000,,-0.4096913,0.1835654,NO,,-0.4026779
EAEAASLAEDAQQK,ph,S,395,true,"STN8 phosphoproteome",38,21768351,"MASCOT Score",75.3600000,,,,,,-1.0822000
EAEAASLAEDAQQK,ph,S,395,true,"Chloroplast kinase substrates",60,19376835,"MASCOT Score",64.1500000,,,,,,0.3318620
EAEAASLAEDAQQK,ph,S,395,true,"atm and atr DNA damage response",88,25561503,"MASCOT Score",79.0000000,1.0000000,,,,,-1.0100000
EAEAASLAEDAQQK,ph,S,395,true,"TOR Kinase and ABA Receptor",100,29290610,XCorr,4.4338508,1.0000000,,,,1.3850000186721E-6,
EAEAASLAEDAQQK,ph,S,395,true,"Tissue atlas Arabidopsis - ProteomicsDB",114,32188942,"MaxQuant score",241.0700000,1.0000000,,,,0,
LSEKEAEAASLAEDAQQKADAVGVTVDGLFNK,ph,T,410,true,"MAPK Arabidopsis substrates",45,23172892,"MaxQuant Score",139.5900000,,,,,,
ADAVGVTVDGLFNK,ph,T,410,true,"STN8 phosphoproteome",38,21768351,"MASCOT Score",73.5900000,,,,,,-2.1392100
ADAVGVTVDGLFNK,ph,T,410,true,"atm and atr DNA damage response",88,25561503,"MASCOT Score",69.0000000,1.0000000,,,,,-1.4200000
ADAVGVTVDGLFNK,ph,T,410,true,"Protein sumoylation and phosphorylation cross-talk",97,28419593,,,,,,,,
ADAVGVTVDGLFNK,ph,T,410,true,"TOR Kinase and ABA Receptor",100,29290610,XCorr,3.7700253,1.0000000,,,,1.2909999895783E-5,
ADAVGVTVDGLFNK,ph,T,410,true,"Tissue atlas Arabidopsis - ProteomicsDB",114,32188942,"MaxQuant score",220.0900000,1.0000000,,,,0,
ADAVGVTVDGLFNK,ph,T,410,true,"Touch-induced phosphorylation: 40s touch vs untouc",136,30291188,"MASCOT score",87.1500000,,-0.0836084,0.8586366,NO,,6.1419927
ADAVGVTVDGLFNKAK,ac,K,417,true,"Histone deacetylases - apicidin vs control",98a,29061669,"MaxQuant Score",171.3000000,1.0000000,0.0500000,0.7638358,NO,2.9006878211524E-42,
ADAVGVTVDGLFNKAK,ac,K,417,true,"Histone deacetylases - hda14 vs WT (thylakoids)",98d,29061669,"MaxQuant Score",169.9000000,1.0000000,2.7520000,0.1803018,NO,6.8400002322713E-23,
ADAVGVTVDGLFNKAK,ac,K,417,true,"Histone deacetylases substrates - hda14 vs WT",98e,29061669,"MaxQuant Score",124.6000000,1.0000000,1.7010000,0.2606154,NO,2.7999999607308E-27,
AKDISSGLSWNK,ac,K,419,true,"Histone deacetylases - hda14 vs WT (thylakoids)",98d,29061669,"MaxQuant Score",96.5000000,1.0000000,2.2830000,0.1753881,NO,0.0005890000029467,
DISSGLSWNK,ph,S,426,true,"Tissue atlas Arabidopsis - ProteomicsDB",114,32188942,"MaxQuant score",111.5200000,0.9954910,,,,0.0002093819930451,
LGSQFATAIQNASETPK,ph,S,432,true,"atm and atr DNA damage response",88,25561503,"MASCOT Score",41.0000000,0.9950000,,,,,-2.9500000
LGSQFATAIQNASETPK,ph,S,432,true,"Tissue atlas Arabidopsis - ProteomicsDB",114,32188942,"MaxQuant score",210.9100000,1.0000000,,,,0,
LGSQFATAIQNASETPK,ph,S,432,true,"Touch-induced phosphorylation: 40s touch vs untouc",136,30291188,"MASCOT score",111.8000000,,-0.1337957,0.5729316,NO,,-1.6604243
LGSQFATAIQNASETPK,ph,T,436,true,"TOR Kinase and ABA Receptor",100,29290610,XCorr,5.5092702,1.0000000,,,,1.8000000068241E-7,
LGSQFATAIQNASETPK,ph,T,436,true,"Tissue atlas Arabidopsis - ProteomicsDB",114,32188942,"MaxQuant score",346.0400000,1.0000000,,,,0,
LGSQFATAIQNASETPK,ph,T,436,true,"Touch-induced phosphorylation: 40s touch vs untouc",136,30291188,"MASCOT score",97.9800000,,-0.2380026,0.4467905,NO,,-1.6604243
LGSQFATAIQNASETPKVQVATVRGQAK,ph,T,451,true,"MAPK Arabidopsis substrates",45,23172892,"MaxQuant Score",186.6300000,,,,,,
LGSQFATAIQNASETPKVQVATVRGQAK,ph,T,451,true,"Phosphoproteome ethylene-regulated time response",46,24043427,"MASCOT Score",81.7200000,,,,,,1.3411000
LGSQFATAIQNASETPKVQVATVR,ph,T,451,true,"STN8 phosphoproteome",38,21768351,"MASCOT Score",70.3300000,,,,,,-1.0452500
LGSQFATAIQNASETPKVQVATVR,ph,T,451,true,"MAPK Arabidopsis substrates",45,23172892,"MaxQuant Score",120.3300000,,,,,,
LGSQFATAIQNASETPKVQVATVR,ph,T,451,true,"Phosphoproteome ethylene-regulated time response",46,24043427,"MASCOT Score",39.4800000,,,,,,-0.7527000
LGSQFATAIQNASETPKVQVATVR,ph,T,451,true,"Chloroplast kinase substrates",60,19376835,"MASCOT Score",73.0700000,,,,,,-1.0452500
VQVATVRGQAK,ph,T,451,true,"STN8 phosphoproteome",38,21768351,"MASCOT Score",65.5900000,,,,,,-0.4915610
VQVATVRGQAK,ph,T,451,true,"MAPK Arabidopsis substrates",45,23172892,"MaxQuant Score",147.2600000,,,,,,
VQVATVRGQAK,ph,T,451,true,"Phosphoproteome ethylene-regulated time response",46,24043427,"MASCOT Score",61.0800000,,,,,,34.2699000
VQVATVRGQAK,ph,T,451,true,"Chloroplast kinase substrates",60,19376835,"MASCOT Score",66.2200000,,,,,,-0.4915610
VQVATVRGQAK,ph,T,451,true,"atm and atr DNA damage response",88,25561503,"MASCOT Score",49.0000000,1.0000000,,,,,-0.7600000
VQVATVRGQAK,ph,T,451,true,"Protein sumoylation and phosphorylation cross-talk",97,28419593,,,,,,,,
VQVATVRGQAK,ph,T,451,true,"TOR Kinase and ABA Receptor",100,29290610,XCorr,3.0905285,1.0000000,,,,2.7489999411046E-5,
VQVATVRGQAK,ph,T,451,true,"Tissue atlas Arabidopsis - ProteomicsDB",114,32188942,"MaxQuant score",161.2600000,1.0000000,,,,0,
VQVATVR,ph,T,451,true,"STN8 phosphoproteome",38,21768351,"MASCOT Score",51.5000000,,,,,,0.4366060
VQVATVR,ph,T,451,true,"Phosphoproteome ethylene-regulated time response",46,24043427,"MASCOT Score",31.1000000,,,,,,17.9652000
VQVATVR,ph,T,451,true,"Chloroplast kinase substrates",60,19376835,"MASCOT Score",51.9200000,,,,,,0.4366060
VQVATVR,ph,T,451,true,"TOR Kinase and ABA Receptor",100,29290610,XCorr,2.6682727,1.0000000,,,,0.00077059998875484,
QRPSSPFASK,ph,S,473,true,"atm and atr DNA damage response",88,25561503,"MASCOT Score",48.0000000,0.9970000,,,,,-1.5000000
