Peptide,PTM,ModifiedAA,ModifiedPosition,PeptideUniqueToGene,ExperimentDesc,ExpID,PubmedID,ScoreType,IdentScore,LocProb,Log2FChange,PQ-val,QuantSig,PEP,MassErrorPPM
TRSSIAMGTPSFLELK,ph,S,9,true,"TOR Kinase and ABA Receptor",100,29290610,XCorr,5.3986740,0.9148000,,,,2.5279999249506E-7,
TRSSIAMGTPSFLELK,ph,S,9,true,"Tissue atlas Arabidopsis - ProteomicsDB",114,32188942,"MaxQuant score",245.1000000,0.9849360,,,,0,
SSIAMGTPSFLELK,ph,S,9,true,"Large-scale phosphorylation discovery",44,23111157,XCorr,4.2740000,,,,,,
KQASFFFK,ph,S,26,true,"atm and atr DNA damage response",88,25561503,"MASCOT Score",35.0000000,1.0000000,,,,,-2.0200000
KQASFFFK,ph,S,26,true,"Phospho cell culture sucrose/TOR",109,30833711,,,1.0000000,,,,,
QASFFFK,ph,S,26,true,"srk2dei ABA signaling phopshoproteomics",83,23572148,"MASCOT Score",36.0000000,,,,,,-0.0001000
QASFFFK,ph,S,26,true,"TOR Kinase and ABA Receptor",100,29290610,XCorr,2.0160434,1.0000000,,,,0.032090000808239,
QASFFFK,ph,S,26,true,"Tissue atlas Arabidopsis - ProteomicsDB",114,32188942,"MaxQuant score",157.2800000,1.0000000,,,,0.00060515699442476,
GIQGFGSFNHK,ph,S,186,true,"Large-scale phosphorylation discovery",44,23111157,XCorr,2.9570000,,,,,,
GIQGFGSFNHK,ph,S,186,true,"MAPK Arabidopsis substrates",45,23172892,"MaxQuant Score",86.9110000,,,,,,
GIQGFGSFNHK,ph,S,186,true,"Tyrosine phosphorylation in Arabidopsis",59,18463617,"MASCOT Score",25.0000000,,,,,,-0.3935307
GIQGFGSFNHK,ph,S,186,true,"srk2dei ABA signaling phopshoproteomics",83,23572148,"MASCOT Score",50.0000000,,,,,,0.0002000
GIQGFGSFNHK,ph,S,186,true,"SnRK2 protein kinase substrates",85,23776212,XCorr,2.3568432,1.0000000,,,,0.035638298839331,
GIQGFGSFNHK,ph,S,186,true,"atm and atr DNA damage response",88,25561503,"MASCOT Score",46.0000000,1.0000000,,,,,-0.8400000
GIQGFGSFNHK,ph,S,186,true,"Brassinosteroid-Regulated Phosphorylation Dynamics",94,26187819,"MaxQuant Score",125.7300000,1.0000000,,,,0.0040000001899898,0.4980000
GIQGFGSFNHK,ph,S,186,true,"TOR Kinase and ABA Receptor",100,29290610,XCorr,2.2934995,1.0000000,,,,0.0021510000806302,
GIQGFGSFNHK,ph,S,186,true,"Phospho cell culture sucrose/TOR",109,30833711,,,1.0000000,,,,,
GIQGFGSFNHK,ph,S,186,true,"Tissue atlas Arabidopsis - ProteomicsDB",114,32188942,"MaxQuant score",193.2800000,1.0000000,,,,2.3507600333211E-18,
KCNSNFTK,ph,S,213,true,"atm and atr DNA damage response",88,25561503,"MASCOT Score",31.0000000,1.0000000,,,,,-3.3500000
