Peptide,PTM,ModifiedAA,ModifiedPosition,PeptideUniqueToGene,ExperimentDesc,ExpID,PubmedID,ScoreType,IdentScore,LocProb,Log2FChange,PQ-val,QuantSig,PEP,MassErrorPPM
ASSDKQTSPKPPPSPSPLR,nt,A,2,true,"Stromal N-terminome",96,26371235,"MASCOT Score",44.0300000,,,,,,
ASSDKQTSPKPPPSPSPLR,nt,A,2,true,"Arg/N-end rule seed, prt6 vs. Wt",99,29168982,"MASCOT Score",26.3700000,,,,,0.0001678999979049,-1.1392579
ASSDKQTSPKPPPSPSPLR,nt,A,2,true,"FtsH12 N-terminome: WT / FtsH12 knockdown miRNA",118,33216923,"MaxQuant score",129.5600000,,,,,0,
ASSDKQTSPK,nt,A,2,true,"N-term acetylation drought responses",5,26184543,,,,,,,,
ASSDKQTSPKPPPSPSPLR,nta,A,2,true,"Arg/N-end rule pathway Roots",80,25728785,"MASCOT Score",42.1400000,,,,,0.00012880000576843,
ASSDKQTSPKPPPSPSPLR,nta,A,2,true,"Stromal N-terminome",96,26371235,"MASCOT Score",44.0300000,,,,,,
ASSDKQTSPKPPPSPSPLR,nta,A,2,true,"Arg/N-end rule seed, prt6 vs. Wt",99,29168982,"MASCOT Score",26.3700000,,-0.1661911,0.0812939,NO,0.0001678999979049,-1.1392579
ASSDKQTSPKPPPSPSPLR,nta,A,2,true,"Arabidopsis translation initiation landscape - NTA",167a,35069635,,,,,,,,
ASSDKQTSPK,nta,A,2,true,"N-term acetylation drought responses",5,26184543,,,,,,,,
ASSDKQTSPKPPPSPSPLR,ac,K,6,true,"Lysine acetylation gel-based Finkemeier et al",37,21311031,i-probability,0.9998540,,,,,,
ASSDKQTSPKPPPSPSPLR,ph,T,8,true,"Tissue atlas Arabidopsis - ProteomicsDB",114,32188942,"MaxQuant score",201.6100000,0.8080730,,,,0,
QTSPKPPPSPSPLR,ph,T,8,true,"Lateral root-induction - NAA vs control",106,23328941,"MASCOT Score",29.0000000,,,,,,
QTSPKPPPSPSPLR,ph,S,9,true,"srk2dei ABA signaling phopshoproteomics",83,23572148,"MASCOT Score",33.0000000,,,,,,-0.0023000
QTSPKPPPSPSPLR,ph,S,9,true,"atm and atr DNA damage response",88,25561503,"MASCOT Score",40.0000000,0.9950000,,,,,-1.2300000
QTSPKPPPSPSPLR,ph,S,9,true,"TOR Kinase and ABA Receptor",100,29290610,XCorr,2.8800321,0.9066000,,,,1.0630000360834E-5,
QTSPKPPPSPSPLR,ph,S,9,true,"Lateral root-induction - NAA vs control",106,23328941,"MASCOT Score",23.0000000,,,,,,
QTSPKPPPSPSPLR,ph,S,9,true,"Phospho cell culture sucrose/TOR",109,30833711,,,0.9674990,,,,,
QTSPKPPPSPSPLR,ph,S,9,true,"Col-0 callus - FC Col-0 vs. Col-0 Xray",111a,31410901,,23.9200000,,0.4087995,0.0000000,NO,,0.1994668
QTSPKPPPSPSPLR,ph,S,9,true,"Col-0 X-ray callus - FC Col-0 vs. Col-0 Xray",111b,31410901,,23.9200000,,0.4087995,0.0000000,NO,,0.1994668
QTSPKPPPSPSPLR,ph,S,9,true,"atm callus - FC atm vs. atm Xray",111c,31410901,,23.9200000,,0.7575669,0.0000000,NO,,0.1994668
QTSPKPPPSPSPLR,ph,S,9,true,"atm-3 X-ray callus - FC atm vs. atm Xray",111d,31410901,,23.9200000,,0.7575669,0.0000000,NO,,0.1994668
QTSPKPPPSPSPLR,ph,S,9,true,"Tissue atlas Arabidopsis - ProteomicsDB",114,32188942,"MaxQuant score",247.3600000,0.9999810,,,,0,
QTSPKPPPSPSPLR,ph,S,15,true,"srk2dei ABA signaling phopshoproteomics",83,23572148,"MASCOT Score",38.0000000,,,,,,-0.0011000
QTSPKPPPSPSPLR,ph,S,15,true,"atm and atr DNA damage response",88,25561503,"MASCOT Score",33.0000000,0.9960000,,,,,-0.8400000
QTSPKPPPSPSPLR,ph,S,15,true,"TOR Kinase and ABA Receptor",100,29290610,XCorr,3.0815406,0.9377000,,,,7.8400000802503E-7,
QTSPKPPPSPSPLR,ph,S,15,true,"Lateral root-induction - NAA vs control",106,23328941,"MASCOT Score",29.0000000,,,,,,
QTSPKPPPSPSPLR,ph,S,15,true,"Phospho cell culture sucrose/TOR",109,30833711,,,0.9980980,,,,,
QTSPKPPPSPSPLR,ph,S,15,true,"Col-0 callus - FC Col-0 vs. Col-0 Xray",111a,31410901,,38.7200000,,0.7697034,0.0000000,NO,,-0.1159038
QTSPKPPPSPSPLR,ph,S,15,true,"Col-0 X-ray callus - FC Col-0 vs. Col-0 Xray",111b,31410901,,38.7200000,,0.7697034,0.0000000,NO,,-0.1159038
QTSPKPPPSPSPLR,ph,S,15,true,"atm callus - FC atm vs. atm Xray",111c,31410901,,38.7200000,,1.2769906,0.0000000,NO,,-0.1159038
QTSPKPPPSPSPLR,ph,S,15,true,"atm-3 X-ray callus - FC atm vs. atm Xray",111d,31410901,,38.7200000,,1.2769906,0.0000000,NO,,-0.1159038
QTSPKPPPSPSPLR,ph,S,15,true,"Tissue atlas Arabidopsis - ProteomicsDB",114,32188942,"MaxQuant score",227.2500000,0.9999970,,,,0,
QTSPKPPPSPSPLR,ph,S,17,true,"Tissue atlas Arabidopsis - ProteomicsDB",114,32188942,"MaxQuant score",196.6100000,0.9999870,,,,0,
IYHLACPASPIFYK,acy,C,102,false,"Arabidopsis S-acylation atlas - Stem",163f,35681017,,,,,,,,
IYHLACPASPIFYK,ph,S,105,false,"Tissue atlas Arabidopsis - ProteomicsDB",114,32188942,"MaxQuant score",233.0200000,1.0000000,,,,0,
SCYDEGKR,so,C,171,false,"S-sulfenylation site detection using YAP1C",110,32714340,,,,,,,,
GEALTVQKPGTQTR,ub,K,232,false,"Arabidopsis ubiquitination COFRADIC",40,26744219,"MaxQuant Score",54.8980000,1.0000000,,,,0.00062960002105683,-0.1780000
ELINPSIEIK,ph,S,286,false,"Tissue atlas Arabidopsis - ProteomicsDB",114,32188942,"MaxQuant score",123.2000000,1.0000000,,,,0.00011235399870202,
