Peptide,PTM,ModifiedAA,ModifiedPosition,PeptideUniqueToGene,ExperimentDesc,ExpID,PubmedID,ScoreType,IdentScore,LocProb,Log2FChange,PQ-val,QuantSig,PEP,MassErrorPPM
VNMGGPLVASNNDTLTR,ng,N,217,true,"Conserved N-glycosylation",74,22633491,"MaxQuant Score",163.6700000,0.8930000,,,,5.1829994455798E-39,0.1640000
VNMGGPLVASNNDTLTR,ng,N,217,true,"UDP-GlcNAc transporter glycopeptide analysis",135,30224661,,,,,,,5.1210637508348E-8,-0.4000000
MNNSKGQLSTGTFVPGSSSSSK,ng,N,381,true,"N-Glycopeptide Profiling in Arabidopsis Infloresce",132,27067053,"MOWSE score",19.9000000,,,,,0.0027999999001622,
TWMPFSINGTSMGSK,ph,S,446,true,"Tissue atlas Arabidopsis - ProteomicsDB",114,32188942,"MaxQuant score",64.1360000,0.9704960,,,,0.00025494198780507,
IPFAAVKDATNNFDESR,ub,K,479,true,"Ubiquitination Membrane Proteins",120,33585938,,,,,,,,
NIGVGGFGKVYKGELNDGTK,ub,K,498,true,"Ubiquitination Membrane Proteins",120,33585938,,,,,,,,
NIGVGGFGKVYK,ub,K,498,true,"upl3 mutant / wildtype",168,35926874,"MaxQuant score",67.0800000,1.0000000,0.3470987,,,0.0029538399539888,0.3572100
VYKGELNDGTK,ub,K,501,true,"Ubiquitination Membrane Proteins",120,33585938,,,,,,,,
VYKGELNDGTK,ub,K,501,true,"upl3 mutant / wildtype",168,35926874,"MaxQuant score",81.9200000,1.0000000,1.4885150,0.0892590,NO,0.0014762399950996,-0.3539400
GNPKSQQGLAEFR,ac,K,518,true,"Quantitative Acetylproteomics",101,29440448,,,,,,,,
TGPELDQTHVSTAVK,ph,S,643,true,"Plasmembrane Ph Immune Responses",25,17651370,,,,,,,,
TGPELDQTHVSTAVK,ph,T,644,true,"TOR Kinase and ABA Receptor",100,29290610,XCorr,4.3657484,0.9288000,,,,0.00012559999595396,
GSFGYLDPEYFR,ph,S,649,false,"Plasmamembrane phosphorylation",20,15308754,,,,,,,,
GSFGYLDPEYFR,ph,S,649,false,"Pollen phosphoproteome Arabidopsis",43,22631563,"MASCOT Score",45.2500000,,,,,,
GSFGYLDPEYFR,ph,S,649,false,"Tyrosine phosphorylation in Arabidopsis",59,18463617,"MASCOT Score",29.0000000,,,,,,-0.9806349
GSFGYLDPEYFR,ph,S,649,false,"TOR Kinase and ABA Receptor",100,29290610,XCorr,3.2853138,0.9999000,,,,0.0030320000369102,
GSFGYLDPEYFR,ph,S,649,false,"Tissue atlas Arabidopsis - ProteomicsDB",114,32188942,"MaxQuant score",101.3900000,0.9999880,,,,0.00012155299918959,
FEESSIDDLSGVSMSK,ph,S,808,true,"Phosphorylation Early Elicitor Signaling",23,17317660,,,,,,,,
FEESSIDDLSGVSMSK,ph,S,808,true,"Tissue atlas Arabidopsis - ProteomicsDB",114,32188942,"MaxQuant score",156.0000000,0.9980190,,,,4.2975598936717E-14,
FEESSIDDLSGVSMSK,ph,S,813,true,"Tissue atlas Arabidopsis - ProteomicsDB",114,32188942,"MaxQuant score",150.9100000,0.7805200,,,,7.8564196814845E-11,
FEESSIDDLSGVSMSK,ph,S,816,true,"Tissue atlas Arabidopsis - ProteomicsDB",114,32188942,"MaxQuant score",214.5000000,0.9799080,,,,0,
FEESSIDDLSGVSMSK,ph,S,818,true,"TOR Kinase and ABA Receptor",100,29290610,XCorr,4.7866988,0.9996000,,,,7.2699997133441E-8,
FEESSIDDLSGVSMSK,ph,S,818,true,"Tissue atlas Arabidopsis - ProteomicsDB",114,32188942,"MaxQuant score",200.9900000,0.9581540,,,,6.4239001308996E-37,
VFSQLVK,ph,S,822,true,"TOR Kinase and ABA Receptor",100,29290610,XCorr,3.0614460,1.0000000,,,,0.004135999828577,
VFSQLVK,ph,S,822,true,"Tissue atlas Arabidopsis - ProteomicsDB",114,32188942,"MaxQuant score",139.0200000,1.0000000,,,,0.010820100083947,
VFSQLVKSEGR,ac,K,826,true,"Quantitative Acetylproteomics",101,29440448,,,,,,,,
VFSQLVKSEGR,ph,S,827,true,"Tissue atlas Arabidopsis - ProteomicsDB",114,32188942,"MaxQuant score",128.9600000,1.0000000,,,,1.2723299732897E-5,
