Peptide,PTM,ModifiedAA,ModifiedPosition,PeptideUniqueToGene,ExperimentDesc,ExpID,PubmedID,ScoreType,IdentScore,LocProb,Log2FChange,PQ-val,QuantSig,PEP,MassErrorPPM
MEPTEKPSTK,nta,M,1,true,"N-term acetylation drought responses",5,26184543,,,,,,,,
GTSPQPRPQQEPAPSNPVR,ph,T,57,true,"srk2dei ABA signaling phopshoproteomics",83,23572148,"MASCOT Score",43.0000000,,,,,,-0.0003000
GTSPQPRPQQEPAPSNPVR,ph,T,57,true,"LAXIC - mannitol vs control",84b,23660473,XCorr,3.4500000,0.8810000,-1.4708243,,NO,0.0010150399757549,
GTSPQPRPQQEPAPSNPVR,ph,T,57,true,"SnRK2 protein kinase substrates",85,23776212,XCorr,3.2869322,0.8870000,,,,0.010601799935102,
GTSPQPRPQQEPAPSNPVR,ph,S,58,true,"Ethylene-regulated phosphorylation ein2 mutant",30,19253305,"MASCOT Score",26.1261000,,,,,,-2.3010476
GTSPQPRPQQEPAPSNPVR,ph,S,58,true,"Phosphoproteome ethylene-regulated time response",46,24043427,"MASCOT Score",67.7700000,,,,,,-13.1552000
GTSPQPRPQQEPAPSNPVR,ph,S,58,true,"Chloroplast kinase substrates",60,19376835,"MASCOT Score",41.9000000,,,,,,-0.9307750
GTSPQPRPQQEPAPSNPVR,ph,S,58,true,"srk2dei ABA signaling phopshoproteomics",83,23572148,"MASCOT Score",62.0000000,,,,,,-0.0006000
GTSPQPRPQQEPAPSNPVR,ph,S,58,true,"atm and atr DNA damage response",88,25561503,"MASCOT Score",29.0000000,0.9150000,,,,,0.1700000
GTSPQPRPQQEPAPSNPVR,ph,S,58,true,"Protein sumoylation and phosphorylation cross-talk",97,28419593,,,,,,,,
GTSPQPRPQQEPAPSNPVR,ph,S,58,true,"Tissue atlas Arabidopsis - ProteomicsDB",114,32188942,"MaxQuant score",160.8800000,0.9997690,,,,7.3069598186853E-23,
DPSPETISKK,ph,S,97,true,"atm and atr DNA damage response",88,25561503,"MASCOT Score",47.0000000,1.0000000,,,,,-3.0000000
TITAEKPQK,ac,K,105,true,"Quantitative Acetylproteomics",101,29440448,,,,,,,,
TDTKTGKPQGVGVR,ph,T,128,true,"Tissue atlas Arabidopsis - ProteomicsDB",114,32188942,"MaxQuant score",83.2530000,0.9593300,,,,0.00020567099272739,
TGKPQGVGVRNSGGTENDPNGK,ph,S,141,true,"TOR Kinase and ABA Receptor",100,29290610,XCorr,2.8911333,0.9842000,,,,0.00055240001529455,
TGKPQGVGVRNSGGTENDPNGK,ph,S,141,true,"Tissue atlas Arabidopsis - ProteomicsDB",114,32188942,"MaxQuant score",155.1600000,0.9998730,,,,5.069449988938E-38,
NSGGTENDPNGKK,ph,S,141,true,"atm and atr DNA damage response",88,25561503,"MASCOT Score",36.0000000,1.0000000,,,,,-2.1400000
NSGGTENDPNGK,ph,S,141,true,"atm and atr DNA damage response",88,25561503,"MASCOT Score",45.0000000,1.0000000,,,,,-1.2500000
NSQNSCRSSGEMSDGDVPGGR,ph,S,159,true,"srk2dei ABA signaling phopshoproteomics",83,23572148,"MASCOT Score",31.0000000,,,,,,-0.0003000
NSQNSCRSSGEMSDGDVPGGR,ph,S,159,true,"TOR Kinase and ABA Receptor",100,29290610,XCorr,4.3757768,0.8752000,,,,0.0015300000086427,
NSQNSCRSSGEMSDGDVPGGR,ph,S,162,true,"srk2dei ABA signaling phopshoproteomics",83,23572148,"MASCOT Score",32.0000000,,,,,,-0.0003000
NSQNSCRSSGEMSDGDVPGGR,ph,S,162,true,"atm and atr DNA damage response",88,25561503,"MASCOT Score",49.0000000,0.9820000,,,,,-0.1700000
NSQNSCRSSGEMSDGDVPGGR,ph,S,165,true,"atm and atr DNA damage response",88,25561503,"MASCOT Score",48.0000000,1.0000000,,,,,-0.1300000
NSQNSCRSSGEMSDGDVPGGR,ph,S,165,true,"Tissue atlas Arabidopsis - ProteomicsDB",114,32188942,"MaxQuant score",187.9700000,0.9721240,,,,0,
SSGEMSDGDVPGGR,ph,S,165,true,"LAXIC - ABA stress",84a,23660473,XCorr,3.9100000,0.9040000,,,,0.032747000455856,
SSGEMSDGDVPGGR,ph,S,165,true,"LAXIC - mannitol vs control",84b,23660473,XCorr,3.3100000,0.9230000,-1.4980309,,NO,0.00041881398647092,
SSGEMSDGDVPGGR,ph,S,165,true,"atm and atr DNA damage response",88,25561503,"MASCOT Score",74.0000000,0.9560000,,,,,-0.3300000
NSQNSCRSSGEMSDGDVPGGR,ph,S,166,true,"atm and atr DNA damage response",88,25561503,"MASCOT Score",49.0000000,0.9820000,,,,,-0.1700000
NSQNSCRSSGEMSDGDVPGGR,ph,S,166,true,"Tissue atlas Arabidopsis - ProteomicsDB",114,32188942,"MaxQuant score",187.9700000,0.9971270,,,,0,
SSGEMSDGDVPGGR,ph,S,166,true,"Ethylene-regulated phosphorylation ein2 mutant",30,19253305,"MASCOT Score",34.5679000,,,,,,11.1010420
SSGEMSDGDVPGGR,ph,S,166,true,"atm and atr DNA damage response",88,25561503,"MASCOT Score",82.0000000,0.9440000,,,,,-0.4800000
SSGEMSDGDVPGGR,ph,S,166,true,"Protein sumoylation and phosphorylation cross-talk",97,28419593,,,,,,,,
NSQNSCRSSGEMSDGDVPGGR,ph,S,170,true,"atm and atr DNA damage response",88,25561503,"MASCOT Score",49.0000000,1.0000000,,,,,-0.1700000
NSQNSCRSSGEMSDGDVPGGR,ph,S,170,true,"TOR Kinase and ABA Receptor",100,29290610,XCorr,4.3757768,1.0000000,,,,0.0015300000086427,
SSGEMSDGDVPGGR,ph,S,170,true,"Ethylene-regulated phosphorylation ein2 mutant",30,19253305,"MASCOT Score",49.3827000,,,,,,-3.5864909
SSGEMSDGDVPGGR,ph,S,170,true,"Chloroplast kinase substrates",60,19376835,"MASCOT Score",39.0000000,,,,,,-0.7484360
SSGEMSDGDVPGGR,ph,S,170,true,"srk2dei ABA signaling phopshoproteomics",83,23572148,"MASCOT Score",31.0000000,,,,,,-0.0003000
SSGEMSDGDVPGGR,ph,S,170,true,"LAXIC - ABA stress",84a,23660473,XCorr,2.8500000,1.0000000,,,,5.3600000683218E-5,
SSGEMSDGDVPGGR,ph,S,170,true,"LAXIC - mannitol vs control",84b,23660473,XCorr,3.5600000,1.0000000,,,,0.0049527701921761,
SSGEMSDGDVPGGR,ph,S,170,true,"SnRK2 protein kinase substrates",85,23776212,XCorr,3.5423295,1.0000000,,,,0.0040952698327601,
SSGEMSDGDVPGGR,ph,S,170,true,"atm and atr DNA damage response",88,25561503,"MASCOT Score",61.0000000,1.0000000,,,,,-0.2000000
SSGEMSDGDVPGGR,ph,S,170,true,"TOR Kinase and ABA Receptor",100,29290610,XCorr,4.1468139,1.0000000,,,,1.6779999612027E-7,
SSGEMSDGDVPGGR,ph,S,170,true,"Tissue atlas Arabidopsis - ProteomicsDB",114,32188942,"MaxQuant score",211.7500000,1.0000000,,,,0,
SGIPRVSEDLK,ph,S,179,true,"srk2dei ABA signaling phopshoproteomics",83,23572148,"MASCOT Score",33.0000000,,,,,,-0.0005000
SGIPRVSEDLK,ph,S,185,true,"srk2dei ABA signaling phopshoproteomics",83,23572148,"MASCOT Score",36.0000000,,,,,,-0.0002000
SGIPRVSEDLK,ph,S,185,true,"atm and atr DNA damage response",88,25561503,"MASCOT Score",24.0000000,1.0000000,,,,,-1.3000000
SGIPRVSEDLK,ph,S,185,true,"TOR Kinase and ABA Receptor",100,29290610,XCorr,2.2589285,0.8465000,,,,0.018740000203252,
SGIPRVSEDLK,ph,S,185,true,"Tissue atlas Arabidopsis - ProteomicsDB",114,32188942,"MaxQuant score",129.7700000,1.0000000,,,,9.8520104074851E-6,
ETLAAGNNYCGR,sno,C,261,true,"hot5-4 / wildtype, FAT-switch S-nitrosoproteome",169,37277371,,,,-0.4901163,0.0256429,NO,,
DMATNSVTELVEAVK,ph,S,335,true,"Tissue atlas Arabidopsis - ProteomicsDB",114,32188942,"MaxQuant score",85.3620000,0.9739860,,,,4.957330020261E-5,
ALSESTNLHPF,nt,A,348,true,"Arg/N-end rule seed, prt6 vs. Wt",99,29168982,"MASCOT Score",49.3500000,,-1.9007066,0.0570111,NO,0.016610000282526,-0.6260748
ALSESTNLHPFMTKSESDELPK,ph,S,350,true,"MAPK Arabidopsis substrates",45,23172892,"MaxQuant Score",74.4440000,,,,,,
ALSESTNLHPFMTK,ph,S,350,true,"STN8 phosphoproteome",38,21768351,"MASCOT Score",73.0500000,,,,,,
ALSESTNLHPFMTK,ph,S,350,true,"Large-scale phosphorylation discovery",44,23111157,XCorr,2.9000000,,,,,,
ALSESTNLHPFMTK,ph,S,350,true,"MAPK Arabidopsis substrates",45,23172892,"MaxQuant Score",107.7400000,,,,,,
ALSESTNLHPFMTK,ph,S,350,true,"Phosphoproteome ethylene-regulated time response",46,24043427,"MASCOT Score",93.1000000,,,,,,-0.4741000
ALSESTNLHPFMTK,ph,S,350,true,"PAMP-triggered phosphorylation",48,24601666,"MASCOT Score",46.0200000,,,,,,
ALSESTNLHPFMTK,ph,S,350,true,"Chloroplast kinase substrates",60,19376835,"MASCOT Score",69.5200000,,,,,,-0.9818440
ALSESTNLHPFMTK,ph,S,350,true,"srk2dei ABA signaling phopshoproteomics",83,23572148,"MASCOT Score",84.0000000,,,,,,-0.0001000
ALSESTNLHPFMTK,ph,S,350,true,"LAXIC - ABA stress",84a,23660473,XCorr,3.1700000,0.9980000,,,,0.058853898197412,
ALSESTNLHPFMTK,ph,S,350,true,"SnRK2 protein kinase substrates",85,23776212,XCorr,3.3347318,1.0000000,,,,3.96250006599E-16,
ALSESTNLHPFMTK,ph,S,350,true,"atm and atr DNA damage response",88,25561503,"MASCOT Score",48.0000000,1.0000000,,,,,-1.1100000
ALSESTNLHPFMTK,ph,S,350,true,"TOR Kinase and ABA Receptor",100,29290610,XCorr,3.9956245,1.0000000,,,,1.3050000234216E-5,
ALSESTNLHPFMTK,ph,S,350,true,"Tissue atlas Arabidopsis - ProteomicsDB",114,32188942,"MaxQuant score",305.4300000,1.0000000,,,,0,
ALSESTNLHPFMTK,ph,S,350,true,"Touch-induced phosphorylation: 40s touch vs untouc",136,30291188,"MASCOT score",84.8700000,,0.1990166,0.7084524,NO,,5.2401102
RMSENVVPSGR,ph,S,376,true,"Chloroplast kinase substrates",60,19376835,"MASCOT Score",56.5300000,,,,,,-0.7958680
RMSENVVPSGR,ph,S,376,true,"atm and atr DNA damage response",88,25561503,"MASCOT Score",42.0000000,1.0000000,,,,,-0.5100000
RMSENVVPSGR,ph,S,376,true,"TOR Kinase and ABA Receptor",100,29290610,XCorr,2.9758751,0.9994000,,,,0.005020999815315,
RMSENVVPSGR,ph,S,376,true,"Tissue atlas Arabidopsis - ProteomicsDB",114,32188942,"MaxQuant score",152.8800000,1.0000000,,,,4.400530162485E-9,
RMSENVVPSGR,ph,S,376,true,"Touch-induced phosphorylation: 40s touch vs untouc",136,30291188,"MASCOT score",55.3900000,,-0.1889209,0.3697345,NO,,4.6196989
MSENVVPSGR,ph,S,382,true,"Tissue atlas Arabidopsis - ProteomicsDB",114,32188942,"MaxQuant score",149.0200000,1.0000000,,,,2.0775199516265E-7,
SRKSSLSFMGIK,ph,S,406,true,"srk2dei ABA signaling phopshoproteomics",83,23572148,"MASCOT Score",25.0000000,,,,,,0.0001000
SRKSSLSFMGIK,ph,S,409,true,"atm and atr DNA damage response",88,25561503,"MASCOT Score",26.0000000,1.0000000,,,,,-0.7700000
KSSLSFMGIK,ph,S,409,true,"atm and atr DNA damage response",88,25561503,"MASCOT Score",58.0000000,0.9950000,,,,,-2.6200000
KSSLSFMGIK,ph,S,409,true,"Tissue atlas Arabidopsis - ProteomicsDB",114,32188942,"MaxQuant score",147.4100000,0.9994730,,,,2.5923700377462E-5,
SSLSFMGIK,ph,S,409,true,"atm and atr DNA damage response",88,25561503,"MASCOT Score",37.0000000,1.0000000,,,,,-0.9200000
SRKSSLSFMGIK,ph,S,410,true,"srk2dei ABA signaling phopshoproteomics",83,23572148,"MASCOT Score",25.0000000,,,,,,0.0001000
SRKSSLSFMGIK,ph,S,410,true,"atm and atr DNA damage response",88,25561503,"MASCOT Score",26.0000000,1.0000000,,,,,-0.7700000
KSSLSFMGIK,ph,S,410,true,"STN8 phosphoproteome",38,21768351,"MASCOT Score",54.0900000,,,,,,
KSSLSFMGIK,ph,S,410,true,"Phosphoproteome ethylene-regulated time response",46,24043427,"MASCOT Score",68.0300000,,,,,,-8.1062000
KSSLSFMGIK,ph,S,410,true,"PAMP-triggered phosphorylation",48,24601666,"MASCOT Score",40.6100000,,,,,,
KSSLSFMGIK,ph,S,410,true,"Chloroplast kinase substrates",60,19376835,"MASCOT Score",51.3500000,,,,,,0.0373503
KSSLSFMGIK,ph,S,410,true,"SnRK2 protein kinase substrates",85,23776212,XCorr,2.1666174,0.9680000,,,,0.043217398226261,
KSSLSFMGIK,ph,S,410,true,"atm and atr DNA damage response",88,25561503,"MASCOT Score",54.0000000,0.9270000,,,,,0.7100000
KSSLSFMGIK,ph,S,410,true,"Tissue atlas Arabidopsis - ProteomicsDB",114,32188942,"MaxQuant score",197.1300000,0.9993210,,,,4.8476000503225E-14,
KSSLSFMGIK,ph,S,410,true,"Touch-induced phosphorylation: 40s touch vs untouc",136,30291188,"MASCOT score",61.8300000,,-0.0749893,0.4033346,NO,,6.4624196
SSLSFMGIK,ph,S,410,true,"atm and atr DNA damage response",88,25561503,"MASCOT Score",51.0000000,0.9940000,,,,,-1.3600000
KSSLSFMGIK,ph,S,412,true,"atm and atr DNA damage response",88,25561503,"MASCOT Score",54.0000000,1.0000000,,,,,-2.7000000
KSSLSFMGIK,ph,S,412,true,"Tissue atlas Arabidopsis - ProteomicsDB",114,32188942,"MaxQuant score",122.4500000,0.9989450,,,,4.3080999603262E-5,
SSLSFMGIK,ph,S,412,true,"atm and atr DNA damage response",88,25561503,"MASCOT Score",32.0000000,0.9970000,,,,,-2.4500000
SSLSFMGIK,ph,S,412,true,"TOR Kinase and ABA Receptor",100,29290610,XCorr,2.8661654,1.0000000,,,,0.0046060001477599,
SESLDESIDDGFIEYGEEDDEISDRDERPESVDDK,ph,Y,434,true,"TOR Kinase and ABA Receptor",100,29290610,XCorr,5.7449293,0.9601000,,,,4.4749999688065E-6,
EEDDEISDR,nt,E,436,true,"Arg/N-end rule seed, prt6 vs. Wt",99,29168982,"MASCOT Score",24.7800000,,-0.4407934,0.0225357,NO,0.15150000154972,-4.4049754
SESLDESIDDGFIEYGEEDDEISDRDERPESVDDKVR,ph,S,442,true,"PAMP-triggered phosphorylation",48,24601666,"MASCOT Score",24.3500000,,,,,,
KSESLDESIDDGFIEYGEEDDEISDRDERPESVDDK,ph,S,442,true,"SnRK2 protein kinase substrates",85,23776212,XCorr,4.0541034,0.8820000,,,,8.9254298396568E-12,
KSESLDESIDDGFIEYGEEDDEISDRDERPESVDDK,ph,S,442,true,"TOR Kinase and ABA Receptor",100,29290610,XCorr,4.8548927,0.9808000,,,,7.1479997131974E-5,
SESLDESIDDGFIEYGEEDDEISDRDERPESVDDK,ph,S,442,true,"TOR Kinase and ABA Receptor",100,29290610,XCorr,5.1886964,0.9392000,,,,8.9879998995457E-5,
SESLDESIDDGFIEYGEEDDEISDRDERPESVDDKVR,ph,S,450,true,"SnRK2 protein kinase substrates",85,23776212,XCorr,4.3572769,0.9410000,,,,0.053893100470304,
KSESLDESIDDGFIEYGEEDDEISDRDERPESVDDK,ph,S,450,true,"TOR Kinase and ABA Receptor",100,29290610,XCorr,4.8206000,0.9311000,,,,0.0028800000436604,
SESLDESIDDGFIEYGEEDDEISDRDERPESVDDK,ph,S,450,true,"TOR Kinase and ABA Receptor",100,29290610,XCorr,5.7449293,0.9949000,,,,4.4749999688065E-6,
DERPESVDDKVR,ph,S,450,true,"STN8 phosphoproteome",38,21768351,"MASCOT Score",51.9200000,,,,,,0.5300060
DERPESVDDKVR,ph,S,450,true,"Chloroplast kinase substrates",60,19376835,"MASCOT Score",52.4600000,,,,,,0.5300060
DERPESVDDKVR,ph,S,450,true,"atm and atr DNA damage response",88,25561503,"MASCOT Score",33.0000000,1.0000000,,,,,-1.1100000
DERPESVDDKVR,ph,S,450,true,"Tissue atlas Arabidopsis - ProteomicsDB",114,32188942,"MaxQuant score",205.8700000,1.0000000,,,,3.1818699088801E-19,
DERPESVDDK,ph,S,450,true,"STN8 phosphoproteome",38,21768351,"MASCOT Score",50.0300000,,,,,,-0.9101740
DERPESVDDK,ph,S,450,true,"Chloroplast kinase substrates",60,19376835,"MASCOT Score",38.1600000,,,,,,-0.3906960
PESVDDKVR,ph,S,450,true,"atm and atr DNA damage response",88,25561503,"MASCOT Score",31.0000000,1.0000000,,,,,-0.5300000
IEKNFVITDPR,ub,K,475,true,"upl3 mutant / wildtype",168,35926874,"MaxQuant score",69.0300000,1.0000000,-1.0892673,0.3351800,NO,0.0021335200872272,0.7223100
FLQGPETDLTTVKK,ub,K,526,true,"Ubiquitination Membrane Proteins",120,33585938,,,,,,,,
FLQGPETDLTTVKK,ub,K,526,true,"upl3 mutant / wildtype",168,35926874,"MaxQuant score",68.9720000,1.0000000,0.7706176,0.4212400,NO,0.002510349964723,1.6033000
ELPDANMTPE,nt,E,614,true,"Arg/N-end rule seed, prt6 vs. Wt",99,29168982,"MASCOT Score",50.9800000,,-1.5293117,0.2968766,NO,0.010390000417829,-1.8744437
KPQLLIPSIDE,nt,K,816,true,"Arg/N-end rule seed, prt6 vs. Wt",99,29168982,"MASCOT Score",25.6500000,,-0.4965794,0.0963831,NO,0.0077940002083778,-3.1582415
QKTFTNVLQK,ub,K,899,true,"Ubiquitination Membrane Proteins",120,33585938,,,,,,,,
QKTFTNVLQK,ub,K,899,true,"upl3 mutant / wildtype",168,35926874,"MaxQuant score",104.2200000,1.0000000,0.6387689,,,0.00097027001902461,0.0139370
DLKFPASIPASLQVK,ub,K,910,true,"upl3 mutant / wildtype",168,35926874,"MaxQuant score",85.2800000,1.0000000,2.0161397,,,1.7836000552052E-5,-0.2636600
LGCFEGANEVK,sno,C,939,true,"hot5-4 / wildtype, FAT-switch S-nitrosoproteome",169,37277371,,,,0.1477642,0.7177325,NO,,
