Peptide,PTM,ModifiedAA,ModifiedPosition,PeptideUniqueToGene,ExperimentDesc,ExpID,PubmedID,ScoreType,IdentScore,LocProb,Log2FChange,PQ-val,QuantSig,PEP,MassErrorPPM
RANIEQEGNTVKEPIQNIK,nt,R,56,true,"Stromal N-terminome",96,26371235,"MASCOT Score",40.6500000,,,,,,
RANIEQEGNTVKEPIQNIK,nta,R,56,true,"Stromal N-terminome",96,26371235,"MASCOT Score",40.6500000,,,,,,
ANIEQEGNTVKEPIQNIK,ph,T,65,true,"Tissue atlas Arabidopsis - ProteomicsDB",114,32188942,"MaxQuant score",118.7200000,1.0000000,,,,1.9430099890139E-11,
GLDDIADIR,nt,G,94,true,"Stromal N-terminome",96,26371235,"MASCOT Score",61.5100000,,,,,,
SLLVELISAKTDQR,nt,S,105,true,"N-terminal ChaFRADIC",92,26010716,"MASCOT Score",25.7300000,,,,,1.1819999912177E-7,
SLLVELISAKTDQR,nt,S,105,true,"Stromal N-terminome",96,26371235,"MASCOT Score",46.0700000,,,,,,
TDQRITVEDYAQR,ph,T,120,true,"Tissue atlas Arabidopsis - ProteomicsDB",114,32188942,"MaxQuant score",115.8700000,1.0000000,,,,3.9577200368512E-5,
QLFLKGVELK,ac,K,166,true,"Histone deacetylases - apicidin vs control",98a,29061669,"MaxQuant Score",90.1000000,1.0000000,0.1450000,0.4325138,NO,9.9999997473788E-5,
LPGGSITFTCESWVAPKSVDPTK,ac,K,188,true,"Histone deacetylases - hda14 vs WT (thylakoids)",98d,29061669,"MaxQuant Score",48.9000000,1.0000000,0.8940000,0.8394600,NO,1.5300000086427E-5,
SVDPTKR,ac,K,194,true,"Quantitative Acetylproteomics",101,29440448,,,,,,,,
IFFSDKSYLPSQTPEPLKK,ac,K,201,true,"Histone deacetylases - hda14 vs WT (thylakoids)",98d,29061669,"MaxQuant Score",88.4000000,1.0000000,0.3430000,0.9506048,NO,8.6100001911102E-13,
IFFSDKSYLPSQTPEPLKK,ac,K,201,true,"Quantitative Acetylproteomics",101,29440448,,,,,,,,
SYLPSQTPEPLKK,ac,K,213,true,"Quantitative Acetylproteomics",101,29440448,,,,,,,,
KEELETLQGKNR,ac,K,226,true,"Quantitative Acetylproteomics",101,29440448,,,,,,,,
EELETLQGKNR,ac,K,226,true,"Quantitative Acetylproteomics",101,29440448,,,,,,,,
EELETLQGKNR,cr,K,226,true,"Open search Plant PTM Viewer 2.0 - Crotonylation",164c,TBA,,,,,,,,
NREEVGEFTKFER,ac,K,236,true,"Histone deacetylases - apicidin vs control",98a,29061669,"MaxQuant Score",96.1000000,1.0000000,0.2300000,0.4036454,NO,0.00011999999696855,
NREEVGEFTKFER,ac,K,236,true,"Histone deacetylases substrates - TSA vs control",98b,29061669,"MaxQuant Score",96.1000000,1.0000000,-0.1530000,0.9794900,NO,0.00011999999696855,
NREEVGEFTKFER,ac,K,236,true,"Histone deacetylases substrates - hda14 vs WT",98e,29061669,"MaxQuant Score",90.7000000,1.0000000,0.4170000,0.9099133,NO,9.9999999747524E-7,
NREEVGEFTKFER,ac,K,236,true,"Quantitative Acetylproteomics",101,29440448,,,,,,,,
EEVGEFTKFER,ac,K,236,true,"Quantitative Acetylproteomics",101,29440448,,,,,,,,
KPCETDPSSEQR,sno,C,281,true,"Site-specific nitrosomeproteomic id - gsnor1-3",90a,25699590,XCorr,2.2819662,,,,,4.1139999666484E-5,-5.7106708
KPCETDPSSEQR,sno,C,281,true,"Site-specific nitrosomeproteomic id - gsnor1-3",90b,25699590,XCorr,2.6700000,,,,,0.071970000863075,-5.7700000
SVLLSPQEPFPHFKAIQNLFEE,nt,S,329,true,"N-terminal ChaFRADIC",92,26010716,"MASCOT Score",29.6800000,,,,,0.00010769999789773,
IIKALGEAQDDILQFDAPVLINR,ac,K,369,true,"Histone deacetylases - hda14 vs WT (thylakoids)",98d,29061669,"MaxQuant Score",104.7000000,1.0000000,0.5160000,0.9057326,NO,2.2299999240158E-26,
GNMTVDEALKNK,ac,K,457,true,"Quantitative Acetylproteomics",101,29440448,,,,,,,,
ELNNTTLYASR,nt,E,479,true,"Stromal N-terminome",96,26371235,"MASCOT Score",57.3400000,,,,,,
THACTEPYIIAANR,nt,T,558,true,"N-terminal ChaFRADIC",92,26010716,"MASCOT Score",42.0600000,,,,,1.012000012679E-7,
THACTEPYIIAANR,acy,C,561,true,"Arabidopsis S-acylation atlas - Meristem",163a,35681017,,,,,,,,
THACTEPYIIAANR,acy,C,561,true,"Arabidopsis S-acylation atlas - Leaf",163c,35681017,,,,,,,,
THACTEPYIIAANR,acy,C,561,true,"Arabidopsis S-acylation atlas - Silique",163e,35681017,,,,,,,,
THACTEPYIIAANR,sno,C,561,true,"hot5-4 / wildtype, FAT-switch S-nitrosoproteome",169,37277371,,,,,,,,
QLSAMHPIYR,nt,Q,572,true,"HUNTER N-terminome: legumain, GluC and trypsin",119,31951383,"MaxQuant score",127.4000000,,,,,,
QSLVNGGGIIETCFWPGK,ox,C,611,true,"SPEAR - 10 mM H2O2 / mock",138a,34619326,,,,1.8095050,0.0343085,YES,,
FDQEGLPADLIKR,ac,K,643,true,"Quantitative Acetylproteomics",101,29440448,,,,,,,,
GLAEEDKTAEHGVR,ac,K,651,true,"Histone deacetylases - apicidin vs control",98a,29061669,"MaxQuant Score",115.9000000,1.0000000,0.1480000,0.7161434,NO,1.6000000312664E-23,
GLAEEDKTAEHGVR,ac,K,651,true,"Histone deacetylases substrates - hda14 vs WT",98e,29061669,"MaxQuant Score",213.2000000,1.0000000,0.2100000,0.9099133,NO,0,
GLAEEDKTAEHGVR,ac,K,651,true,"Quantitative Acetylproteomics",101,29440448,,,,,,,,
GLAEEDKTAEHGVR,cr,K,651,true,"Open search Plant PTM Viewer 2.0 - Crotonylation",164c,TBA,,,,,,,,
EFYESPEKVLLK,ac,K,790,true,"Histone deacetylases - apicidin vs control",98a,29061669,"MaxQuant Score",59.3000000,1.0000000,0.2460000,0.2371374,NO,0.0040000001899898,
VLLKTYPSQK,ac,K,794,true,"Histone deacetylases - hda14 vs WT (thylakoids)",98d,29061669,"MaxQuant Score",118.3000000,1.0000000,0.6400000,0.7816278,NO,0.0020000000949949,
VLLKTYPSQK,ac,K,794,true,"Quantitative Acetylproteomics",101,29440448,,,,,,,,
LQYLEGVIDER,ph,Y,849,true,"Tissue atlas Arabidopsis - ProteomicsDB",114,32188942,"MaxQuant score",155.1100000,1.0000000,,,,8.2241902177316E-10,
NVNITLKNR,ac,K,864,true,"Quantitative Acetylproteomics",101,29440448,,,,,,,,
