Peptide,PTM,ModifiedAA,ModifiedPosition,PeptideUniqueToGene,ExperimentDesc,ExpID,PubmedID,ScoreType,IdentScore,LocProb,Log2FChange,PQ-val,QuantSig,PEP,MassErrorPPM
VAAPPSVPTSDSTEEKR,nt,V,50,true,"Tic56 chloroplast import - wild-type",89a,25588737,XCorr,3.7730768,,,,,,
VAAPPSVPTSDSTEEKR,nt,V,50,true,"Tic56 chloroplast import - tic56-1",89c,25588737,XCorr,3.3407834,,,,,,
VAAPPSVPTSDSTEEKR,nt,V,50,true,"N-terminal ChaFRADIC",92,26010716,"MASCOT Score",88.5800000,,,,,3.8900000731701E-7,
VAAPPSVPTSDSTEEK,nt,V,50,true,"N-terminal ChaFRADIC",92,26010716,"MASCOT Score",55.1700000,,,,,7.2719998911452E-8,
VAAPPSVPTSDSTE,nt,V,50,true,"N-terminal ChaFRADIC",92,26010716,"MASCOT Score",27.9100000,,,,,0.0038409999106079,
VAAPPSVPTSDSTEEKR,nta,V,50,true,"Tic56 chloroplast import - wild-type",89a,25588737,XCorr,3.7730768,,,,,,
VAAPPSVPTSDSTEEKR,nta,V,50,true,"Tic56 chloroplast import - tic56-1",89c,25588737,XCorr,3.3407834,,,,,,
VAAPPSVPTSDSTEEKR,nta,V,50,true,"N-terminal ChaFRADIC",92,26010716,"MASCOT Score",88.5800000,,,,,3.8900000731701E-7,
VAAPPSVPTSDSTEEKR,nta,V,50,true,"HUNTER N-terminome: legumain, GluC and trypsin",119,31951383,"MaxQuant score",57.8020000,,,,,,
VAAPPSVPTSDSTEEK,nta,V,50,true,"Characterization plant N-terminal acetylation",6,22223895,"MASCOT Score",57.0000000,,,,,,
VAAPPSVPTSDSTEEK,nta,V,50,true,"N-terminal ChaFRADIC",92,26010716,"MASCOT Score",55.1700000,,,,,7.2719998911452E-8,
VAAPPSVPTSDSTE,nta,V,50,true,"HUNTER N-terminome: legumain, GluC and trypsin",119,31951383,"MaxQuant score",56.0130000,,,,,,
VAAPPSVPTSD,nta,V,50,true,"HUNTER N-terminome: legumain, GluC and trypsin",119,31951383,"MaxQuant score",44.3490000,,,,,,
SEGRLDENGHLQ,nt,S,138,true,"N-terminal ChaFRADIC",92,26010716,"MASCOT Score",28.1200000,,,,,0.00015140000323299,
VESSGPWGFQGANDDSPR,ph,S,289,true,"Tissue atlas Arabidopsis - ProteomicsDB",114,32188942,"MaxQuant score",140.8400000,1.0000000,,,,2.8144899486758E-15,
VFLAKSMESPDYDVNK,ac,K,390,true,"Quantitative Acetylproteomics",101,29440448,,,,,,,,
