Peptide,PTM,ModifiedAA,ModifiedPosition,PeptideUniqueToGene,ExperimentDesc,ExpID,PubmedID,ScoreType,IdentScore,LocProb,Log2FChange,PQ-val,QuantSig,PEP,MassErrorPPM
MEFWGIEVK,nta,M,1,true,"Characterization plant N-terminal acetylation",6,22223895,"MASCOT Score",54.9000000,,,,,,
SGKPVTVTPEEGILIHVSQASLGECK,sno,C,34,true,"hot5-4 / wildtype, FAT-switch S-nitrosoproteome",169,37277371,,,,1.2743235,0.0006248,YES,,
TPNIEPQGYSEEEEEEEEEVPAGNAAK,ph,Y,102,true,"Large-scale phosphorylation discovery",44,23111157,XCorr,4.0370000,,,,,,
TPNIEPQGYSEEEEEEEEEVPAGNAAK,ph,Y,102,true,"PAMP-triggered phosphorylation",48,24601666,"MASCOT Score",41.5800000,,,,,,
TPNIEPQGYSEEEEEEEEEVPAGNAAK,ph,Y,102,true,"LAXIC - ABA stress",84a,23660473,XCorr,5.1200000,0.9070000,,,,0.0072532398626208,
TPNIEPQGYSEEEEEEEEEVPAGNAAK,ph,Y,102,true,"Lateral root-induction - NAA vs control",106,23328941,"MASCOT Score",39.0000000,,0.9374522,0.0001465,YES,,
TPNIEPQGYSEEEEEEEEEVPAGNAAK,ph,S,103,true,"Arabidopsis root NAA phosphoproteome",18a,27643528,"MaxQuant Score",191.6200000,1.0000000,,,,0,-0.4600000
TPNIEPQGYSEEEEEEEEEVPAGNAAK,ph,S,103,true,"STN8 phosphoproteome",38,21768351,"MASCOT Score",53.1900000,,,,,,-1.3642600
TPNIEPQGYSEEEEEEEEEVPAGNAAK,ph,S,103,true,"Phosphoproteomic analysis of seed maturation",42,22440515,"MASCOT Score",86.0000000,,,,,,-2.0300000
TPNIEPQGYSEEEEEEEEEVPAGNAAK,ph,S,103,true,"PAMP-triggered phosphorylation",48,24601666,"MASCOT Score",43.9800000,,,,,,
TPNIEPQGYSEEEEEEEEEVPAGNAAK,ph,S,103,true,"Chloroplast kinase substrates",60,19376835,"MASCOT Score",45.5200000,,,,,,-1.5605100
TPNIEPQGYSEEEEEEEEEVPAGNAAK,ph,S,103,true,"BSK8 and BSL2 regulating sucrose-ph synthase",66,24924143,"MaxQuant Score",102.6600000,,,,,,-0.3032500
TPNIEPQGYSEEEEEEEEEVPAGNAAK,ph,S,103,true,"srk2dei ABA signaling phopshoproteomics",83,23572148,"MASCOT Score",76.0000000,,,,,,0.0019000
TPNIEPQGYSEEEEEEEEEVPAGNAAK,ph,S,103,true,"LAXIC - mannitol vs control",84b,23660473,XCorr,4.8700000,0.9420000,,,,6.2799998534757E-10,
TPNIEPQGYSEEEEEEEEEVPAGNAAK,ph,S,103,true,"SnRK2 protein kinase substrates",85,23776212,XCorr,4.7172518,0.9290000,,,,0.0020749799441546,
TPNIEPQGYSEEEEEEEEEVPAGNAAK,ph,S,103,true,"SIRK1 phosphorylation",86a,23820729,"MaxQuant Score",176.7800000,0.8680000,,,,3.3599999952477E-13,2.3740000
TPNIEPQGYSEEEEEEEEEVPAGNAAK,ph,S,103,true,"Lateral root-induction - NAA vs control",106,23328941,"MASCOT Score",58.0000000,,-0.2403452,0.2294717,NO,,
TPNIEPQGYSEEEEEEEEEVPAGNAAK,ph,S,103,true,"Col-0 callus - FC Col-0 vs. Col-0 Xray",111a,31410901,,46.7400000,,0.5197350,0.0000000,NO,,1.3438354
TPNIEPQGYSEEEEEEEEEVPAGNAAK,ph,S,103,true,"Col-0 X-ray callus - FC Col-0 vs. Col-0 Xray",111b,31410901,,46.7400000,,0.5197350,0.0000000,NO,,1.3438354
TPNIEPQGYSEEEEEEEEEVPAGNAAK,ph,S,103,true,"atm callus - FC atm vs. atm Xray",111c,31410901,,46.7400000,,0.6839594,0.0000000,NO,,1.3438354
TPNIEPQGYSEEEEEEEEEVPAGNAAK,ph,S,103,true,"atm-3 X-ray callus - FC atm vs. atm Xray",111d,31410901,,46.7400000,,0.6839594,0.0000000,NO,,1.3438354
TPNIEPQGYSEEEEEEEEEVPAGNAAK,ph,S,103,true,"Tissue atlas Arabidopsis - ProteomicsDB",114,32188942,"MaxQuant score",246.5100000,1.0000000,,,,0,
TPNIEPQGYSEEEEEEEEEVPAGNAAK,ph,S,103,true,"Touch-induced phosphorylation: 40s touch vs untouc",136,30291188,"MASCOT score",92.4800000,,-0.2584696,0.3044941,NO,,4.7398361
ANETTPKAPVSAK,ph,T,179,true,"Tissue atlas Arabidopsis - ProteomicsDB",114,32188942,"MaxQuant score",170.2300000,0.9963900,,,,5.9462298366425E-13,
ANETTPKAPVSAK,ph,S,185,true,"Tissue atlas Arabidopsis - ProteomicsDB",114,32188942,"MaxQuant score",170.2300000,1.0000000,,,,5.9462298366425E-13,
VAVTPQKTDEKK,ph,T,194,true,"Tissue atlas Arabidopsis - ProteomicsDB",114,32188942,"MaxQuant score",206.6700000,1.0000000,,,,7.8182797359269E-24,
VAVTPQKTDEK,ph,T,194,true,"Large-scale phosphorylation discovery",44,23111157,XCorr,3.0340000,,,,,,
VAVTPQKTDEK,ph,T,194,true,"TOR Kinase and ABA Receptor",100,29290610,XCorr,3.4419003,1.0000000,,,,0.068400003015995,
VAVTPQKTDEKK,ph,T,198,true,"Tissue atlas Arabidopsis - ProteomicsDB",114,32188942,"MaxQuant score",134.0200000,1.0000000,,,,1.2507500287029E-5,
VAVTPQKTDEK,ph,T,198,true,"TOR Kinase and ABA Receptor",100,29290610,XCorr,3.4419003,1.0000000,,,,0.068400003015995,
SASQVSCGSCKK,ox,C,220,true,"OxiTRAQ Arabidopsis - 5 mM H2O2 versus control",47,24376095,,,,0.2060617,0.3020653,NO,,
SASQVSCGSCK,ox,C,220,true,"OxiTRAQ Arabidopsis - 5 mM H2O2 versus control",47,24376095,,,,0.1873668,0.2147041,NO,,
SASQVSCGSCKK,ox,C,223,true,"OxiTRAQ Arabidopsis - 5 mM H2O2 versus control",47,24376095,,,,0.2060617,0.3020653,NO,,
SASQVSCGSCK,ox,C,223,true,"OxiTRAQ Arabidopsis - 5 mM H2O2 versus control",47,24376095,,,,0.1873668,0.2147041,NO,,
KTFNSGNALESHNK,ph,T,226,true,"Tissue atlas Arabidopsis - ProteomicsDB",114,32188942,"MaxQuant score",44.4680000,0.7882220,,,,0.0072289598174393,
TFNSGNALESHNK,ph,S,229,true,"Conserved plant phosphoproteome - Arabidopsis",61a,20466843,"MASCOT Score",20.0000000,1.0000000,,,,,
TFNSGNALESHNK,ph,S,229,true,"Tissue atlas Arabidopsis - ProteomicsDB",114,32188942,"MaxQuant score",230.5500000,1.0000000,,,,0,
ALESHNKAKHAAAK,nt,A,232,true,"Arabidopsis translation initiation landscape - NT",167b,35069635,,,,,,,,
SHNKAKHAAAK,nt,S,235,true,"Arabidopsis translation initiation landscape - NT",167b,35069635,,,,,,,,
TFNSGNALESHNK,ph,S,235,true,"Conserved plant phosphoproteome - Arabidopsis",61a,20466843,"MASCOT Score",20.0000000,1.0000000,,,,,
TFNSGNALESHNK,ph,S,235,true,"TOR Kinase and ABA Receptor",100,29290610,XCorr,4.4859347,1.0000000,,,,0.00018630000704434,
TFNSGNALESHNK,ph,S,235,true,"Lateral root-induction - NAA vs control",106,23328941,"MASCOT Score",42.0000000,,,,,,
TFNSGNALESHNK,ph,S,235,true,"Tissue atlas Arabidopsis - ProteomicsDB",114,32188942,"MaxQuant score",350.9600000,1.0000000,,,,0,
