Peptide,PTM,ModifiedAA,ModifiedPosition,PeptideUniqueToGene,ExperimentDesc,ExpID,PubmedID,ScoreType,IdentScore,LocProb,Log2FChange,PQ-val,QuantSig,PEP,MassErrorPPM
SNGPPPSGMPGGPL,nt,S,207,true,"N-terminal ChaFRADIC",92,26010716,"MASCOT Score",36.1100000,,,,,1.4580000424758E-5,
PGSSSSPIVYETR,ph,S,344,true,"Tissue atlas Arabidopsis - ProteomicsDB",114,32188942,"MaxQuant score",194.1900000,0.9898970,,,,0,
PGSSSSPIVYETR,ph,S,347,true,"Tissue atlas Arabidopsis - ProteomicsDB",114,32188942,"MaxQuant score",128.4700000,0.8645650,,,,7.8314901306501E-19,
CKGYVNPFMK,so,C,436,true,"S-sulfenylation site detection using YAP1C",110,32714340,,,,,,,,
DYQCNLGPDGR,ox,C,470,true,"OxiTRAQ Arabidopsis - 5 mM H2O2 versus control",47,24376095,,,,0.1224161,0.2037070,NO,,
DYQCNLGPDGR,sno,C,470,true,"Site-specific nitrosomeproteomic id - gsnor1-3",90b,25699590,XCorr,2.4600000,,,,,0.060729999095201,-6.1700000
DADERPELCR,ox,C,488,true,"OxiTRAQ Arabidopsis - 5 mM H2O2 versus control",47,24376095,,,,0.1244056,0.2293260,NO,,
LMVFQSVLPSVGIGALSSR,ph,S,643,true,"srk2dei ABA signaling phopshoproteomics",83,23572148,"MASCOT Score",30.0000000,,,,,,0.0020000
LMVFQSVLPSVGIGALSSR,ph,S,647,true,"srk2dei ABA signaling phopshoproteomics",83,23572148,"MASCOT Score",30.0000000,,,,,,0.0020000
LMVFQSVLPSVGIGALSSR,ph,S,654,true,"srk2dei ABA signaling phopshoproteomics",83,23572148,"MASCOT Score",30.0000000,,,,,,0.0020000
LMVFQSVLPSVGIGALSSR,ph,S,655,true,"srk2dei ABA signaling phopshoproteomics",83,23572148,"MASCOT Score",30.0000000,,,,,,0.0020000
LLQPADKTLR,ub,K,680,true,"upl3 mutant / wildtype",168,35926874,"MaxQuant score",48.2840000,1.0000000,-0.8185794,,,0.0082096196711063,1.0634000
IPTDIDLPAIDCDK,sno,C,787,true,"hot5-4 / wildtype, FAT-switch S-nitrosoproteome",169,37277371,,,,,,,,
SADLDSQFACMLK,sno,C,852,true,"Site-specific nitrosomeproteomic id - gsnor1-3",90a,25699590,XCorr,2.8873401,,,,,0.014419999904931,-5.6825995
EQATNDCITILHSYR,so,C,877,true,"Arabidopsis S-sulfenylation chemoproteomics",108,31578252,"pFind PSM Score",0.0000482,,2.2222200,,,,-0.7717805
