Peptide,PTM,ModifiedAA,ModifiedPosition,PeptideUniqueToGene,ExperimentDesc,ExpID,PubmedID,ScoreType,IdentScore,LocProb,Log2FChange,PQ-val,QuantSig,PEP,MassErrorPPM
SSTEEMSSVKNTTQVIGVDPSSTVR,nt,S,2,true,"N-terminal ChaFRADIC",92,26010716,"MASCOT Score",58.6000000,,,,,4.8390002120868E-6,
SSTEEMSSVKNTTQVIGVDPSSTVR,nt,S,2,true,"Arg/N-end rule seed, prt6 vs. Wt",99,29168982,"MASCOT Score",98.6200000,,,,,4.711999963547E-7,-1.9582942
SSTEEMSSVKN,nt,S,2,true,"Arg/N-end rule seed, prt6 vs. Wt",99,29168982,"MASCOT Score",44.4200000,,,,,0.029410000890493,-1.8368204
SSTEEMSSVKNTTQVIGVDPSSTVR,nta,S,2,true,"Arg/N-end rule pathway Roots",80,25728785,"MASCOT Score",31.5900000,,,,,0.0014720000326633,
SSTEEMSSVKNTTQVIGVDPSSTVR,nta,S,2,true,"N-terminal ChaFRADIC",92,26010716,"MASCOT Score",58.6000000,,,,,4.8390002120868E-6,
SSTEEMSSVKNTTQVIGVDPSSTVR,nta,S,2,true,"Arg/N-end rule seed, prt6 vs. Wt",99,29168982,"MASCOT Score",98.6200000,,0.5631150,0.2537639,NO,4.711999963547E-7,-1.9582942
SSTEEMSSVKNTTQVIGVDPSSTVR,nta,S,2,true,"FtsH12 N-terminome: WT / FtsH12 knockdown miRNA",118,33216923,"MaxQuant score",80.0140000,,-0.3572870,0.0740333,NO,5.7100001806072E-26,
SSTEEMSSVKNTTQVIGVDPSSTVR,nta,S,2,true,"Arabidopsis translation initiation landscape - NTA",167a,35069635,,,,,,,,
SSTEEMSSVKN,nta,S,2,true,"Arg/N-end rule seed, prt6 vs. Wt",99,29168982,"MASCOT Score",44.4200000,,0.0576420,0.5932592,NO,0.029410000890493,-1.8368204
SSTEEMSSVK,nta,S,2,true,"Characterization plant N-terminal acetylation",6,22223895,"MASCOT Score",52.0300000,,,,,,
SSVKNTTQVIGVDPSSTVR,nt,S,8,true,"N-terminal ChaFRADIC",92,26010716,"MASCOT Score",36.7400000,,,,,1.0259999726259E-5,
SSVKNTTQVIGVDPSSTVR,nt,S,8,true,"Arg/N-end rule seed, prt6 vs. Wt",99,29168982,"MASCOT Score",40.0100000,,,,,0.00094800000078976,1.8704369
SSVKNTTQVIGVDPSSTVR,nta,S,8,true,"Arg/N-end rule pathway Roots",80,25728785,"MASCOT Score",63.7500000,,,,,8.4860002971254E-6,
SSVKNTTQVIGVDPSSTVR,nta,S,8,true,"N-terminal ChaFRADIC",92,26010716,"MASCOT Score",36.7400000,,,,,1.0259999726259E-5,
SSVKNTTQVIGVDPSSTVR,nta,S,8,true,"Arg/N-end rule seed, prt6 vs. Wt",99,29168982,"MASCOT Score",40.0100000,,0.0549091,0.6851817,NO,0.00094800000078976,1.8704369
VGVHNEEGRDEF,nt,V,81,false,"Arabidopsis translation initiation landscape - NT",167b,35069635,,,,,,,,
VGVHNEEGR,nt,V,81,false,"Arg/N-end rule seed, prt6 vs. Wt",99,29168982,"MASCOT Score",37.8900000,,,,,0.044089999049902,-1.4670164
CIWGQGDGSTIPVYDTPIGK,sno,C,161,false,"Site-specific nitrosomeproteomic id - gsnor1-3",90a,25699590,XCorr,4.6916132,,,,,5.5579999980182E-7,-5.6153746
CIWGQGDGSTIPVYDTPIGK,sno,C,161,false,"Site-specific nitrosomeproteomic id - gsnor1-3",90b,25699590,XCorr,5.1800000,,,,,0.012600000016391,-5.0400000
CIWGQGDGSTIPVYDTPIGK,sno,C,161,false,"S-Nitroso-Proteome guard cells - 60 min flg22",116c,32121556,,,,2.6576400,0.0490000,YES,,
CIWGQGDGSTIPVYDTPIGK,sno,C,161,false,"hot5-4 / wildtype, FAT-switch S-nitrosoproteome",169,37277371,,,,0.4703282,0.0829702,NO,,
CIWGQGDGSTIPVYDTPIGK,so,C,161,false,"S-sulfenylation site detection using YAP1C",110,32714340,,,,,,,,
IGAAICWENR,sno,C,186,false,"S-Nitroso-Proteome guard cells - 15 min flg22",116a,32121556,,,,1.6690268,0.0030000,YES,,
IGAAICWENR,sno,C,186,false,"hot5-4 / wildtype, FAT-switch S-nitrosoproteome",169,37277371,,,,0.1764634,0.0141090,NO,,
IGAAICWENR,so,C,186,false,"Arabidopsis S-sulfenylation chemoproteomics",108,31578252,"pFind PSM Score",0.0062431,,,,,,-1.0502945
IGAAICWENR,so,C,186,false,"S-sulfenylation site detection using YAP1C",110,32714340,,,,,,,,
