Peptide,PTM,ModifiedAA,ModifiedPosition,PeptideUniqueToGene,ExperimentDesc,ExpID,PubmedID,ScoreType,IdentScore,LocProb,Log2FChange,PQ-val,QuantSig,PEP,MassErrorPPM
SSTKDMSTVQNATPFNGVAPSTTVR,nt,S,2,true,"N-terminal ChaFRADIC",92,26010716,"MASCOT Score",61.1200000,,,,,5.7170002065732E-9,
SSTKDMSTVQNATPFNGVAPSTTVR,nt,S,2,true,"Stromal N-terminome",96,26371235,"MASCOT Score",33.6200000,,,,,,
SSTKDMSTVQNATPFNGVAPSTTVR,nt,S,2,true,"Arg/N-end rule seed, prt6 vs. Wt",99,29168982,"MASCOT Score",24.4400000,,,,,0.051339998841286,-5.0444597
SSTKDMSTVQNATPFNGVAPSTTVR,nt,S,2,true,"FtsH12 N-terminome: WT / FtsH12 knockdown miRNA",118,33216923,"MaxQuant score",111.9200000,,0.8645418,0.0138503,YES,6.150000027603E-15,
SSTKDMSTVQNATPF,nt,S,2,true,"Arg/N-end rule seed, prt6 vs. Wt",99,29168982,"MASCOT Score",93.0500000,,,,,0.0012590000405908,-2.2985918
SSTKDMSTVQN,nt,S,2,true,"Arg/N-end rule seed, prt6 vs. Wt",99,29168982,"MASCOT Score",42.3900000,,,,,0.059749998152256,-1.6745183
SSTKDMSTVQ,nt,S,2,true,"N-term acetylation drought responses",5,26184543,,,,,,,,
SSTKDMSTVQ,nt,S,2,true,"Arg/N-end rule seed, prt6 vs. Wt",99,29168982,"MASCOT Score",50.3400000,,,,,0.055750001221895,-1.7530543
SSTKDMSTVQNATPFNGVAPSTTVR,nta,S,2,true,"Arg/N-end rule pathway Roots",80,25728785,"MASCOT Score",53.8100000,,,,,3.296000068076E-5,
SSTKDMSTVQNATPFNGVAPSTTVR,nta,S,2,true,"N-terminal ChaFRADIC",92,26010716,"MASCOT Score",61.1200000,,,,,5.7170002065732E-9,
SSTKDMSTVQNATPFNGVAPSTTVR,nta,S,2,true,"Stromal N-terminome",96,26371235,"MASCOT Score",33.6200000,,,,,,
SSTKDMSTVQNATPFNGVAPSTTVR,nta,S,2,true,"Arg/N-end rule seed, prt6 vs. Wt",99,29168982,"MASCOT Score",24.4400000,,-0.4249540,0.4434386,NO,0.051339998841286,-5.0444597
SSTKDMSTVQNATPFNGVAPSTTVR,nta,S,2,true,"FtsH12 N-terminome: WT / FtsH12 knockdown miRNA",118,33216923,"MaxQuant score",139.4300000,,-0.0002962,0.9982940,NO,0,
SSTKDMSTVQNATPFNGVAPSTTVR,nta,S,2,true,"HUNTER N-terminome: legumain, GluC and trypsin",119,31951383,"MaxQuant score",55.5260000,,,,,,
SSTKDMSTVQNATPFNGVAPSTTVR,nta,S,2,true,"Arabidopsis translation initiation landscape - NTA",167a,35069635,,,,,,,,
SSTKDMSTVQNATPF,nta,S,2,true,"Arg/N-end rule pathway Roots",80,25728785,"MASCOT Score",36.2000000,,,,,0.089900001883507,
SSTKDMSTVQNATPF,nta,S,2,true,"Arg/N-end rule seed, prt6 vs. Wt",99,29168982,"MASCOT Score",93.0500000,,-0.1147927,0.1547086,NO,0.0012590000405908,-2.2985918
SSTKDMSTVQN,nta,S,2,true,"Arg/N-end rule seed, prt6 vs. Wt",99,29168982,"MASCOT Score",42.3900000,,-0.2053205,0.2950251,NO,0.059749998152256,-1.6745183
SSTKDMSTVQ,nta,S,2,true,"N-term acetylation drought responses",5,26184543,,,,,,,,
SSTKDMSTVQ,nta,S,2,true,"Arg/N-end rule seed, prt6 vs. Wt",99,29168982,"MASCOT Score",50.3400000,,-0.1969337,0.3486419,NO,0.055750001221895,-1.7530543
SSTKDMSTVQNATPFNGVAPSTTVR,ub,K,5,true,"upl3 mutant / wildtype",168,35926874,"MaxQuant score",50.2710000,1.0000000,-1.5734669,,,0.00014792500587646,-0.7592900
DMSTVQNATPFNGVAPSTTVR,nt,D,6,true,"Metacaspase9 substrates - 35S:MC9 / mc9",51b,23964026,"MASCOT Score",83.0000000,,2.8437834,,NO,,-2.8044225
STVQNATPFNGVAPSTTVR,nt,S,8,true,"Tic56 chloroplast import - wild-type",89a,25588737,XCorr,2.7517643,,,,,,
STVQNATPFNGVAPSTTVR,nt,S,8,true,"Tic56 chloroplast import - tic56-1",89c,25588737,XCorr,3.8805463,,,,,,
STVQNATPFNGVAPSTTVR,nt,S,8,true,"Stromal N-terminome",96,26371235,"MASCOT Score",98.1600000,,,,,,
STVQNATPFNGVAPSTTVR,nt,S,8,true,"FtsH12 N-terminome: WT / FtsH12 knockdown miRNA",118,33216923,"MaxQuant score",72.6520000,,-0.0862469,0.6334489,NO,3.5900000057154E-6,
STVQNATPFNGVAPSTTVR,nta,S,8,true,"Characterization plant N-terminal acetylation",6,22223895,"MASCOT Score",69.4500000,,,,,,
STVQNATPFNGVAPSTTVR,nta,S,8,true,"Tic56 chloroplast import - wild-type",89a,25588737,XCorr,2.7517643,,,,,,
STVQNATPFNGVAPSTTVR,nta,S,8,true,"Tic56 chloroplast import - tic56-1",89c,25588737,XCorr,3.8805463,,,,,,
STVQNATPFNGVAPSTTVR,nta,S,8,true,"Stromal N-terminome",96,26371235,"MASCOT Score",98.1600000,,,,,,
STVQNATPFNGVAPSTTVR,nta,S,8,true,"HUNTER N-terminome: legumain, GluC and trypsin",119,31951383,"MaxQuant score",280.6200000,,,,,,
STVQNATPFNGVAPSTTVR,nta,S,8,true,"Arabidopsis translation initiation landscape - NTA",167a,35069635,,,,,,,,
DMSTVQNATPFNGVAPSTTVR,ph,S,8,true,"TOR Kinase and ABA Receptor",100,29290610,XCorr,3.9654958,0.7601000,,,,0.0013539999490604,
DMSTVQNATPFNGVAPSTTVR,ph,S,8,true,"Tissue atlas Arabidopsis - ProteomicsDB",114,32188942,"MaxQuant score",213.0100000,0.9628580,,,,0,
NATPFNGVAPSTTVR,nt,N,12,true,"Tic56 chloroplast import - tic56-1",89c,25588737,XCorr,3.1877842,,,,,,
DMSTVQNATPFNGVAPSTTVR,ph,T,14,true,"atm and atr DNA damage response",88,25561503,"MASCOT Score",43.0000000,1.0000000,,,,,0.0200000
DMSTVQNATPFNGVAPSTTVR,ph,T,14,true,"Tissue atlas Arabidopsis - ProteomicsDB",114,32188942,"MaxQuant score",336.2700000,1.0000000,,,,0,
STVYNDTPATIDKAE,nt,S,33,true,"N-terminal ChaFRADIC",92,26010716,"MASCOT Score",22.6900000,,,,,4.5100001443643E-5,
AEKYIVEAASK,ub,K,48,true,"upl3 mutant / wildtype",168,35926874,"MaxQuant score",137.5000000,1.0000000,0.0648829,0.9305600,NO,3.11961000908E-28,-3.1220000
VGVHNEEGRDEF,nt,V,81,false,"Arabidopsis translation initiation landscape - NT",167b,35069635,,,,,,,,
VGVHNEEGR,nt,V,81,false,"Arg/N-end rule seed, prt6 vs. Wt",99,29168982,"MASCOT Score",37.8900000,,,,,0.044089999049902,-1.4670164
KYHASAIHVPGPEVAR,nt,K,94,true,"Arabidopsis translation initiation landscape - NT",167b,35069635,,,,,,,,
KYHASAIHVPGPEVAR,ub,K,94,true,"upl3 mutant / wildtype",168,35926874,"MaxQuant score",46.3370000,1.0000000,-0.9351171,0.3225000,NO,0.0017279000021517,-0.2221800
ASAIHVPGPE,nt,A,97,true,"Arg/N-end rule seed, prt6 vs. Wt",99,29168982,"MASCOT Score",36.2400000,,-0.2767576,0.6462811,NO,0.010420000180602,-1.3457450
KNHVYLVMGAIEK,ub,K,116,true,"upl3 mutant / wildtype",168,35926874,"MaxQuant score",130.2000000,1.0000000,-0.8943219,0.1707600,NO,9.0469200131338E-7,0.5334800
CIWGQGDGSTIPVYDTPIGK,sno,C,161,false,"Site-specific nitrosomeproteomic id - gsnor1-3",90a,25699590,XCorr,4.6916132,,,,,5.5579999980182E-7,-5.6153746
CIWGQGDGSTIPVYDTPIGK,sno,C,161,false,"Site-specific nitrosomeproteomic id - gsnor1-3",90b,25699590,XCorr,5.1800000,,,,,0.012600000016391,-5.0400000
CIWGQGDGSTIPVYDTPIGK,sno,C,161,false,"S-Nitroso-Proteome guard cells - 60 min flg22",116c,32121556,,,,2.6576400,0.0490000,YES,,
CIWGQGDGSTIPVYDTPIGK,sno,C,161,false,"hot5-4 / wildtype, FAT-switch S-nitrosoproteome",169,37277371,,,,0.4703282,0.0829702,NO,,
CIWGQGDGSTIPVYDTPIGK,so,C,161,false,"S-sulfenylation site detection using YAP1C",110,32714340,,,,,,,,
LGAAICWENR,sno,C,186,false,"hot5-4 / wildtype, FAT-switch S-nitrosoproteome",169,37277371,,,,,,,,
TALYAKGIELYCAPTADGSK,hib,K,201,false,"Open search Plant PTM Viewer 2.0 - hib",164e,TBA,,,,,,,,
TALYAKGIELYCAPTADGSK,ub,K,201,false,"upl3 mutant / wildtype",168,35926874,"MaxQuant score",62.3250000,1.0000000,-0.7759597,0.0788850,NO,6.7699496867135E-5,-0.3090500
GIELYCAPTADGSK,sno,C,207,false,"Site-specific nitrosomeproteomic id - gsnor1-3",90a,25699590,XCorr,3.2331905,,,,,6.4660001953598E-5,-5.1755711
GIELYCAPTADGSK,sno,C,207,false,"hot5-4 / wildtype, FAT-switch S-nitrosoproteome",169,37277371,,,,0.4917075,0.0399793,NO,,
GIELYCAPTADGSK,so,C,207,false,"Arabidopsis S-sulfenylation chemoproteomics",108,31578252,"pFind PSM Score",0.1093290,,,,,,1.2079406
GIELYCAPTADGSK,so,C,207,false,"S-sulfenylation site detection using YAP1C",110,32714340,,,,,,,,
IEGGCFVLSACQFCQR,nt,I,226,true,"FtsH12 N-terminome: WT / FtsH12 knockdown miRNA",118,33216923,"MaxQuant score",172.2700000,,-0.9441397,0.0542597,NO,0,
SIVSQGGSVIISPLGQVLAGPNFE,nt,S,263,false,"Arabidopsis translation initiation landscape - NT",167b,35069635,,,,,,,,
DSVGHYSRP,nt,D,308,false,"Arabidopsis translation initiation landscape - NT",167b,35069635,,,,,,,,
SVGHYSRPDVLHLTVNE,nt,S,309,false,"Arabidopsis translation initiation landscape - NT",167b,35069635,,,,,,,,
KSVTFVTKVEK,ub,K,329,true,"upl3 mutant / wildtype",168,35926874,"MaxQuant score",96.1430000,1.0000000,-0.8862995,0.1847600,NO,0.0025828399229795,0.3532400
KSVTFVTK,ph,S,330,true,"STN8 phosphoproteome",38,21768351,"MASCOT Score",53.1300000,,,,,,-0.5627200
KSVTFVTK,ph,S,330,true,"Chloroplast kinase substrates",60,19376835,"MASCOT Score",35.5800000,,,,,,0.0632173
KSVTFVTK,ph,S,330,true,"atm and atr DNA damage response",88,25561503,"MASCOT Score",38.0000000,1.0000000,,,,,-1.4300000
KSVTFVTK,ph,S,330,true,"Tissue atlas Arabidopsis - ProteomicsDB",114,32188942,"MaxQuant score",145.0100000,0.9999650,,,,0.0015349299646914,
SVTFVTK,ph,S,330,true,"srk2dei ABA signaling phopshoproteomics",83,23572148,"MASCOT Score",35.0000000,,,,,,0.0004000
SVTFVTK,ph,T,332,true,"TOR Kinase and ABA Receptor",100,29290610,XCorr,2.4301131,0.9996000,,,,0.0021470000501722,
KSVTFVTKVEKAEDDSNK,ac,K,336,true,"Quantitative Acetylproteomics",101,29440448,,,,,,,,
SVTFVTKVEKAEDDSNK,ac,K,336,true,"Quantitative Acetylproteomics",101,29440448,,,,,,,,
KSVTFVTKVEK,ac,K,336,true,"Quantitative Acetylproteomics",101,29440448,,,,,,,,
SVTFVTKVEK,ac,K,336,true,"Histone deacetylases - apicidin vs control",98a,29061669,"MaxQuant Score",83.2000000,1.0000000,0.0450000,0.7943282,NO,0.00076000002445653,
SVTFVTKVEK,ac,K,336,true,"Histone deacetylases substrates - TSA vs control",98b,29061669,"MaxQuant Score",83.2000000,1.0000000,0.3670000,0.9204496,NO,0.00076000002445653,
SVTFVTKVEK,ac,K,336,true,"Histone deacetylases substrates - hda14 vs WT",98e,29061669,"MaxQuant Score",80.2000000,1.0000000,-0.0520000,0.9225714,NO,0.0020000000949949,
SVTFVTKVEK,ac,K,336,true,"Quantitative Acetylproteomics",101,29440448,,,,,,,,
KSVTFVTKVEK,ub,K,336,true,"upl3 mutant / wildtype",168,35926874,"MaxQuant score",96.1430000,1.0000000,-0.8862995,0.1847600,NO,0.0025828399229795,0.3532400
SVTFVTKVEK,ub,K,336,true,"upl3 mutant / wildtype",168,35926874,"MaxQuant score",71.0760000,1.0000000,0.1256511,0.8339400,NO,0.0022785100154579,-0.5454700
VEKAEDDSNK,cr,K,339,false,"Open search Plant PTM Viewer 2.0 - Crotonylation",164c,TBA,,,,,,,,
VEKAEDDSNK,ac,K,346,false,"Quantitative Acetylproteomics",101,29440448,,,,,,,,
