Peptide,PTM,ModifiedAA,ModifiedPosition,PeptideUniqueToGene,ExperimentDesc,ExpID,PubmedID,ScoreType,IdentScore,LocProb,Log2FChange,PQ-val,QuantSig,PEP,MassErrorPPM
KNPEYRPNASEILK,ph,Y,249,true,"Tissue atlas Arabidopsis - ProteomicsDB",114,32188942,"MaxQuant score",73.8870000,0.8262320,,,,0.001141189946793,
HPYLQPYVEQYRPTLSAASITPEKPLNSR,ph,T,279,true,"Tissue atlas Arabidopsis - ProteomicsDB",114,32188942,"MaxQuant score",56.6370000,0.9344500,,,,3.964719871874E-5,
HPYLQPYVEQYRPTLSAASITPEKPLNSR,ph,S,286,true,"Tissue atlas Arabidopsis - ProteomicsDB",114,32188942,"MaxQuant score",158.9900000,0.9994610,,,,0,
NDRISPSPAAK,ph,S,485,true,"Tissue atlas Arabidopsis - ProteomicsDB",114,32188942,"MaxQuant score",128.7100000,0.9983350,,,,1.3627400221594E-5,
NDRISPSPAAK,ph,S,487,true,"TOR Kinase and ABA Receptor",100,29290610,XCorr,3.1013286,0.9950000,,,,0.009727000258863,
HEAEEAMSVKR,ph,S,499,true,"Tissue atlas Arabidopsis - ProteomicsDB",114,32188942,"MaxQuant score",48.1120000,1.0000000,,,,0.0073804999701679,
QRTPPTLPR,ph,T,506,true,"atm and atr DNA damage response",88,25561503,"MASCOT Score",38.0000000,1.0000000,,,,,0.1100000
QRTPPTLPR,ph,T,506,true,"TOR Kinase and ABA Receptor",100,29290610,XCorr,2.4078918,1.0000000,,,,0.00085299997590482,
QRTPPTLPR,ph,T,506,true,"Tissue atlas Arabidopsis - ProteomicsDB",114,32188942,"MaxQuant score",135.0800000,1.0000000,,,,4.6836499677738E-5,
RTSLIAHQSR,ph,S,515,true,"TOR Kinase and ABA Receptor",100,29290610,XCorr,2.8979676,0.9360000,,,,0.00030869999318384,
RTSLIAHQSR,ph,S,515,true,"Tissue atlas Arabidopsis - ProteomicsDB",114,32188942,"MaxQuant score",65.4720000,0.8197700,,,,0.0018572900444269,
LHPSVPSESETNSHQSR,ph,S,545,true,"Tissue atlas Arabidopsis - ProteomicsDB",114,32188942,"MaxQuant score",54.1500000,0.8858970,,,,0.00063543498981744,
VHASPVSTTPEPK,ph,S,559,true,"SnRK2 protein kinase substrates",85,23776212,XCorr,2.8092823,0.9990000,,,,0.0010858200257644,
VHASPVSTTPEPK,ph,S,559,true,"TOR Kinase and ABA Receptor",100,29290610,XCorr,4.1980753,0.9919000,,,,8.7770004029153E-6,
VHASPVSTTPEPK,ph,S,559,true,"Tissue atlas Arabidopsis - ProteomicsDB",114,32188942,"MaxQuant score",182.3700000,0.9999980,,,,7.2762399342053E-22,
VHASPVSTTPEPK,ph,S,562,true,"Tissue atlas Arabidopsis - ProteomicsDB",114,32188942,"MaxQuant score",113.4300000,0.9451830,,,,8.596180123277E-5,
VHASPVSTTPEPK,ph,T,563,true,"Large-scale phosphorylation discovery",44,23111157,XCorr,3.7890000,,,,,,
VHASPVSTTPEPK,ph,T,564,true,"Large-scale phosphorylation discovery",44,23111157,XCorr,3.9720000,,,,,,
RTSVGSAK,ph,S,571,true,"atm and atr DNA damage response",88,25561503,"MASCOT Score",32.0000000,1.0000000,,,,,-1.3300000
RTSVGSAK,ph,S,574,true,"atm and atr DNA damage response",88,25561503,"MASCOT Score",32.0000000,1.0000000,,,,,-1.3300000
KGATPSESPTTR,ub,K,807,true,"Arabidopsis ubiquitination COFRADIC",40,26744219,"MaxQuant Score",80.3120000,1.0000000,,,,5.5470001925073E-9,-0.0320000
KGATPSESPTTR,ph,T,810,true,"SnRK2 protein kinase substrates",85,23776212,XCorr,3.6049795,0.9880000,,,,0.0024788100272417,
KGATPSESPTTR,ph,T,810,true,"atm and atr DNA damage response",88,25561503,"MASCOT Score",37.0000000,1.0000000,,,,,2.4800000
KGATPSESPTTR,ph,T,810,true,"Tissue atlas Arabidopsis - ProteomicsDB",114,32188942,"MaxQuant score",129.8900000,0.9999570,,,,0.00012110100215068,
KGATPSESPTTR,ph,S,812,true,"atm and atr DNA damage response",88,25561503,"MASCOT Score",37.0000000,0.9920000,,,,,2.4800000
KGATPSESPTTR,ph,S,814,true,"SnRK2 protein kinase substrates",85,23776212,XCorr,3.6049795,0.9760000,,,,0.0024788100272417,
KGATPSESPTTR,ph,S,814,true,"atm and atr DNA damage response",88,25561503,"MASCOT Score",36.0000000,0.9400000,,,,,-0.7100000
KGATPSESPTTR,ph,S,814,true,"Tissue atlas Arabidopsis - ProteomicsDB",114,32188942,"MaxQuant score",151.0300000,0.9980010,,,,3.4316801134082E-7,
SIISEPDSR,ph,S,819,true,"Tissue atlas Arabidopsis - ProteomicsDB",114,32188942,"MaxQuant score",101.3000000,0.9999990,,,,0.0010742699960247,
SIISEPDSR,ph,S,822,true,"Large-scale phosphorylation discovery",44,23111157,XCorr,2.7440000,,,,,,
SIISEPDSR,ph,S,822,true,"Tissue atlas Arabidopsis - ProteomicsDB",114,32188942,"MaxQuant score",87.7130000,0.9999500,,,,0.0027417200617492,
SFNSCSDSSPAETR,ox,C,850,true,"OxiTRAQ Arabidopsis - 5 mM H2O2 versus control",47,24376095,,,,-0.3464304,0.0541221,NO,,
SFNSCSDSSPAETR,ph,S,854,true,"Tissue atlas Arabidopsis - ProteomicsDB",114,32188942,"MaxQuant score",194.6700000,0.9838490,,,,0,
TNSFVPEEETTPTPPVK,ph,S,862,true,"Tissue atlas Arabidopsis - ProteomicsDB",114,32188942,"MaxQuant score",63.3850000,0.9248650,,,,0.00070060702273622,
