Peptide,PTM,ModifiedAA,ModifiedPosition,PeptideUniqueToGene,ExperimentDesc,ExpID,PubmedID,ScoreType,IdentScore,LocProb,Log2FChange,PQ-val,QuantSig,PEP,MassErrorPPM
EGDVLPDEVDWR,nt,E,123,false,"Arg/N-end rule pathway Roots",80,25728785,"MASCOT Score",56.1400000,,,,,0.00051119999261573,
EGDVLPDEVDWR,nt,E,123,false,"Arg/N-end rule seed, prt6 vs. Wt",99,29168982,"MASCOT Score",31.8200000,,0.0559906,0.9480800,NO,0.10790000110865,0.1891241
EGDVLPDEVDWR,nt,E,123,false,"FtsH12 N-terminome: WT / FtsH12 knockdown miRNA",118,33216923,"MaxQuant score",83.3140000,,,,,6.7200001119261E-9,
EGDVLPDEVDWR,nt,E,123,false,"HUNTER N-terminome: legumain, GluC and trypsin",119,31951383,"MaxQuant score",74.1620000,,,,,,
GDVLPDEVDWR,nt,G,124,false,"Arg/N-end rule pathway Roots",80,25728785,"MASCOT Score",51.2400000,,,,,0.0024270000867546,
GDVLPDEVDWR,nt,G,124,false,"Arg/N-end rule seed, prt6 vs. Wt",99,29168982,"MASCOT Score",40.7000000,,-0.2900886,0.3981335,NO,0.018619999289513,-1.9023901
GDVLPDEVDWR,nt,G,124,false,"HUNTER N-terminome: legumain, GluC and trypsin",119,31951383,"MaxQuant score",94.6920000,,,,,,
GDVLPDEVDWR,nta,G,124,false,"FtsH12 N-terminome: WT / FtsH12 knockdown miRNA",118,33216923,"MaxQuant score",113.3800000,,,,,9.0599999291036E-16,
DVLPDEVDWR,nt,D,125,false,"Arg/N-end rule seed, prt6 vs. Wt",99,29168982,"MASCOT Score",37.1800000,,0.4335950,0.3632386,NO,0.099979996681213,-0.2336160
DVLPDEVDWR,nt,D,125,false,"HUNTER N-terminome: legumain, GluC and trypsin",119,31951383,"MaxQuant score",76.4650000,,,,,,
DVLPDEVDWR,nta,D,125,false,"FtsH12 N-terminome: WT / FtsH12 knockdown miRNA",118,33216923,"MaxQuant score",96.3310000,,,,,0.011493000201881,
ENGGIVSDEVYGYTGEDTAACK,acy,C,226,true,"Arabidopsis S-acylation atlas - Meristem",163a,35681017,,,,,,,,
AVAYQPISVMISAANMSDYK,ng,N,270,true,"Conserved N-glycosylation",74,22633491,"MaxQuant Score",129.7100000,1.0000000,,,,3.7599998806784E-20,0.2830000
CAVAVAPVYPIK,acy,C,336,true,"Arabidopsis S-acylation atlas - Meristem",163a,35681017,,,,,,,,
CAVAVAPVYPIK,acy,C,336,true,"Arabidopsis S-acylation atlas - Silique",163e,35681017,,,,,,,,
CAVAVAPVYPIK,sno,C,336,true,"hot5-4 / wildtype, FAT-switch S-nitrosoproteome",169,37277371,,,,-0.0310947,0.6167757,NO,,
