Peptide,PTM,ModifiedAA,ModifiedPosition,PeptideUniqueToGene,ExperimentDesc,ExpID,PubmedID,ScoreType,IdentScore,LocProb,Log2FChange,PQ-val,QuantSig,PEP,MassErrorPPM
AAGGFLTRAFDTMLKE,nt,A,2,true,"N-terminal ChaFRADIC",92,26010716,"MASCOT Score",29.0000000,,,,,0.0011699999449775,
AAGGFLTRAFD,nt,A,2,true,"Arg/N-end rule seed, prt6 vs. Wt",99,29168982,"MASCOT Score",64.6900000,,,,,3.2150000439657E-9,-1.4405744
AAGGFLTRAF,nt,A,2,true,"N-term acetylation drought responses",5,26184543,,,,,,,,
AAGGFLTR,nt,A,2,true,"Stromal N-terminome",96,26371235,"MASCOT Score",62.9500000,,,,,,
AAGGFLTR,nt,A,2,true,"Arg/N-end rule seed, prt6 vs. Wt",99,29168982,"MASCOT Score",69.4300000,,,,,0.00048129999777302,-0.7198473
AAGGFLTRAFDTMLKE,nta,A,2,true,"N-terminal ChaFRADIC",92,26010716,"MASCOT Score",29.0000000,,,,,0.0011699999449775,
AAGGFLTRAFD,nta,A,2,true,"Arg/N-end rule seed, prt6 vs. Wt",99,29168982,"MASCOT Score",64.6900000,,,,,3.2150000439657E-9,-1.4405744
AAGGFLTRAFD,nta,A,2,true,"HUNTER N-terminome: legumain, GluC and trypsin",119,31951383,"MaxQuant score",111.0600000,,,,,,
AAGGFLTRAFD,nta,A,2,true,"Arabidopsis translation initiation landscape - NTA",167a,35069635,,,,,,,,
AAGGFLTRAF,nta,A,2,true,"N-term acetylation drought responses",5,26184543,,,,,,,,
AAGGFLTR,nta,A,2,true,"Characterization plant N-terminal acetylation",6,22223895,"MASCOT Score",63.8200000,,,,,,
AAGGFLTR,nta,A,2,true,"Arg/N-end rule pathway Roots",80,25728785,"MASCOT Score",45.1800000,,,,,0.0066349999979138,
AAGGFLTR,nta,A,2,true,"Stromal N-terminome",96,26371235,"MASCOT Score",62.9500000,,,,,,
AAGGFLTR,nta,A,2,true,"Arg/N-end rule seed, prt6 vs. Wt",99,29168982,"MASCOT Score",69.4300000,,,,,0.00048129999777302,-0.7198473
AAGGFLTR,nta,A,2,true,"HUNTER N-terminome: legumain, GluC and trypsin",119,31951383,"MaxQuant score",89.1420000,,,,,,
AAGGFLTR,ph,T,8,true,"Lateral root-induction - NAA vs control",106,23328941,"MASCOT Score",26.0000000,,,,,,
VVTQAAPSSIVESSQAEGGGEK,ph,S,47,true,"Tissue atlas Arabidopsis - ProteomicsDB",114,32188942,"MaxQuant score",169.7000000,0.9376470,,,,2.1019476964872E-44,
VVTQAAPSSIVESSQAEGGGEK,ph,S,52,true,"Tissue atlas Arabidopsis - ProteomicsDB",114,32188942,"MaxQuant score",166.9100000,0.9372630,,,,2.8025969286496E-44,
VTSAEVAQQASQSK,ph,S,73,true,"Tissue atlas Arabidopsis - ProteomicsDB",114,32188942,"MaxQuant score",188.7100000,0.9981020,,,,0,
VTSAEVAQQASQSK,ph,S,81,true,"Tissue atlas Arabidopsis - ProteomicsDB",114,32188942,"MaxQuant score",131.6100000,0.7817710,,,,3.3422198612243E-5,
IFDAALDCLHK,sno,C,129,true,"hot5-4 / wildtype, FAT-switch S-nitrosoproteome",169,37277371,,,,,,,,
IFDAALDCLHK,so,C,129,true,"Arabidopsis S-sulfenylation chemoproteomics",108,31578252,"pFind PSM Score",0.0006698,,1.0102100,,,,-0.3119440
IFDAALDCLHK,so,C,129,true,"S-sulfenylation site detection using YAP1C",110,32714340,,,,,,,,
VCYNIALNSK,so,C,204,true,"Arabidopsis S-sulfenylation chemoproteomics",108,31578252,"pFind PSM Score",0.2277800,,0.7092200,,,,0.7619150
RMETDIVSASSTVSQEEHVSGDTSSPK,ph,S,257,true,"TOR Kinase and ABA Receptor",100,29290610,XCorr,6.2890468,0.7699000,,,,0.00012129999959143,
EMTLGDALTQAK,ph,T,275,true,"Tissue atlas Arabidopsis - ProteomicsDB",114,32188942,"MaxQuant score",125.8200000,1.0000000,,,,9.9634897196665E-5,
EMTLGDALTQAK,ph,T,281,true,"Tissue atlas Arabidopsis - ProteomicsDB",114,32188942,"MaxQuant score",128.4600000,0.9994310,,,,0.00010386000212748,
GLEAALDKAVHLEDGKK,ac,K,312,true,"Quantitative Acetylproteomics",101,29440448,,,,,,,,
GIELESMSIGQR,ph,S,330,true,"Tissue atlas Arabidopsis - ProteomicsDB",114,32188942,"MaxQuant score",49.0810000,0.8090710,,,,0.011419700458646,
SLDNSECPNDQK,ox,C,468,true,"OxiTRAQ Arabidopsis - 5 mM H2O2 versus control",47,24376095,,,,0.0770382,0.3829527,NO,,
SLDNSECPNDQK,sno,C,468,true,"Site-specific nitrosomeproteomic id - gsnor1-3",90a,25699590,XCorr,2.5048683,,,,,0.030729999765754,-5.5585174
SLDNSECPNDQK,sno,C,468,true,"Site-specific nitrosomeproteomic id - gsnor1-3",90b,25699590,XCorr,3.0500000,,,,,0.019009999930859,-7.3200000
IAQGSQSADPNPAMASQTASVK,ph,S,532,true,"Tissue atlas Arabidopsis - ProteomicsDB",114,32188942,"MaxQuant score",185.1800000,0.8815190,,,,0,
GSSLQCLVNVLK,so,C,544,true,"S-sulfenylation site detection using YAP1C",110,32714340,,,,,,,,
NANEDSASTGEPIETK,ph,S,573,true,"Lateral root-induction - NAA vs control",106,23328941,"MASCOT Score",27.0000000,,,,,,
NANEDSASTGEPIETK,ph,S,575,true,"atm and atr DNA damage response",88,25561503,"MASCOT Score",45.0000000,0.9960000,,,,,-0.0500000
NANEDSASTGEPIETK,ph,S,575,true,"Lateral root-induction - NAA vs control",106,23328941,"MASCOT Score",77.0000000,,-0.0871737,0.6189432,NO,,
NANEDSASTGEPIETK,ph,S,575,true,"Tissue atlas Arabidopsis - ProteomicsDB",114,32188942,"MaxQuant score",318.8200000,0.9819070,,,,0,
NANEDSASTGEPIETK,ph,T,582,true,"Tissue atlas Arabidopsis - ProteomicsDB",114,32188942,"MaxQuant score",240.6100000,0.9999990,,,,0,
NANEDSASTGEPIETKSR,ac,K,583,true,"Quantitative Acetylproteomics",101,29440448,,,,,,,,
NANEDSASTGEPIETKSR,me1,K,583,true,"Arabidopsis protein methylome",123,31809900,"MaxQuant Score",104.8400000,1.0000000,,,,2.0503000265063E-16,0.4146100
EDVPSNFEK,ph,S,590,true,"Tissue atlas Arabidopsis - ProteomicsDB",114,32188942,"MaxQuant score",63.3200000,1.0000000,,,,0.018547300249338,
SREDVPSNFEKAK,ac,K,594,true,"Quantitative Acetylproteomics",101,29440448,,,,,,,,
KLSSQRPGGEER,ph,S,792,true,"Tissue atlas Arabidopsis - ProteomicsDB",114,32188942,"MaxQuant score",53.4030000,0.7511360,,,,0.0092519503086805,
KLSSQRPGGEER,ph,S,793,true,"Tissue atlas Arabidopsis - ProteomicsDB",114,32188942,"MaxQuant score",53.4030000,0.7550840,,,,0.0092519503086805,
RISAADAK,ph,S,817,true,"atm and atr DNA damage response",88,25561503,"MASCOT Score",40.0000000,1.0000000,,,,,-1.4500000
RISAADAK,ph,S,817,true,"Tissue atlas Arabidopsis - ProteomicsDB",114,32188942,"MaxQuant score",120.5500000,1.0000000,,,,0.0022578199859709,
ISAADAKSETEDIVR,ph,S,823,true,"Tissue atlas Arabidopsis - ProteomicsDB",114,32188942,"MaxQuant score",158.5800000,0.9737870,,,,6.9026701672234E-13,
ILLCMEGFK,ox,C,886,true,"SPEAR - 10 mM H2O2 / mock",138a,34619326,,,,0.8876662,0.0005433,YES,,
ILLCMEGFK,so,C,886,true,"Arabidopsis S-sulfenylation chemoproteomics",108,31578252,"pFind PSM Score",0.0895118,,1.2195100,,,,-1.2576704
SKNVEALR,nt,S,927,true,"Arabidopsis translation initiation landscape - NT",167b,35069635,,,,,,,,
LPSESVVEFFTALCGVSAEELK,sno,C,1021,true,"hot5-4 / wildtype, FAT-switch S-nitrosoproteome",169,37277371,,,,0.1564718,0.6532363,NO,,
SLIVDCIVQMIK,ox,C,1131,true,"OxiTRAQ SA and flg22 responses - SA vs mock",91a,25720653,"MASCOT Score",38.5400000,,1.7311832,0.0320000,YES,,
SLIVDCIVQMIK,ox,C,1131,true,"OxiTRAQ SA and flg22 responses - flg22 vs mock",91b,25720653,"MASCOT Score",38.5400000,,0.8479969,0.5500000,NO,,
SLIVDCIVQMIK,so,C,1131,true,"S-sulfenylation site detection using YAP1C",110,32714340,,,,,,,,
ESLISSGDVK,ph,S,1318,true,"Tissue atlas Arabidopsis - ProteomicsDB",114,32188942,"MaxQuant score",85.8130000,0.9002060,,,,0.0018847399624065,
ESLISSGDVK,ph,S,1319,true,"atm and atr DNA damage response",88,25561503,"MASCOT Score",45.0000000,0.9480000,,,,,-0.6000000
ESLISSGDVK,ph,S,1319,true,"Tissue atlas Arabidopsis - ProteomicsDB",114,32188942,"MaxQuant score",146.1600000,0.9773230,,,,6.2931400179878E-7,
ESLISSGDVKFR,ac,K,1323,true,"Quantitative Acetylproteomics",101,29440448,,,,,,,,
DASYTTQPLELLNALSFDNPKK,ph,S,1416,true,"TOR Kinase and ABA Receptor",100,29290610,XCorr,2.4223807,0.9998000,,,,0.00087829999392852,
DASYTTQPLELLNALSFDNPK,ph,S,1416,true,"TOR Kinase and ABA Receptor",100,29290610,XCorr,5.9189000,1.0000000,,,,5.1870000561394E-7,
KNLVLAGDIEADASDSPR,ph,S,1435,true,"Large-scale phosphorylation discovery",44,23111157,XCorr,3.6810000,,,,,,
NLVLAGDIEADASDSPR,ph,S,1435,true,"Tissue atlas Arabidopsis - ProteomicsDB",114,32188942,"MaxQuant score",217.3500000,0.8961520,,,,0,
NLVLAGDIEADASDSPRVDRNPDDIK,ph,S,1437,true,"srk2dei ABA signaling phopshoproteomics",83,23572148,"MASCOT Score",32.0000000,,,,,,-0.0001000
NLVLAGDIEADASDSPRVDRNPDDIK,ph,S,1437,true,"TOR Kinase and ABA Receptor",100,29290610,XCorr,4.4254513,0.9953000,,,,0.00270100007765,
KNLVLAGDIEADASDSPR,ph,S,1437,true,"Large-scale phosphorylation discovery",44,23111157,XCorr,3.9630000,,,,,,
KNLVLAGDIEADASDSPR,ph,S,1437,true,"Tissue atlas Arabidopsis - ProteomicsDB",114,32188942,"MaxQuant score",316.3300000,0.9944650,,,,0,
NLVLAGDIEADASDSPR,ph,S,1437,true,"Large-scale phosphorylation discovery",44,23111157,XCorr,6.2530000,,,,,,
NLVLAGDIEADASDSPR,ph,S,1437,true,"SnRK2 protein kinase substrates",85,23776212,XCorr,4.8072081,1.0000000,,,,3.2396398931545E-12,
NLVLAGDIEADASDSPR,ph,S,1437,true,"atm and atr DNA damage response",88,25561503,"MASCOT Score",62.0000000,1.0000000,,,,,-2.5000000
VDRNPDDIKDNGKVSAQASPR,ph,S,1454,true,"atm and atr DNA damage response",88,25561503,"MASCOT Score",23.0000000,1.0000000,,,,,-3.6000000
NPDDIKDNGKVSAQASPR,ph,S,1454,true,"Tissue atlas Arabidopsis - ProteomicsDB",114,32188942,"MaxQuant score",154.9900000,1.0000000,,,,9.7615898654244E-14,
DNGKVSAQASPR,ph,S,1454,true,"atm and atr DNA damage response",88,25561503,"MASCOT Score",49.0000000,1.0000000,,,,,-1.0700000
VSAQASPR,ph,S,1454,true,"atm and atr DNA damage response",88,25561503,"MASCOT Score",55.0000000,1.0000000,,,,,-0.0100000
VDRNPDDIKDNGKVSAQASPR,ph,S,1458,true,"atm and atr DNA damage response",88,25561503,"MASCOT Score",23.0000000,1.0000000,,,,,-3.6000000
DNGKVSAQASPR,ph,S,1458,true,"atm and atr DNA damage response",88,25561503,"MASCOT Score",49.0000000,1.0000000,,,,,-1.0700000
VSAQASPR,ph,S,1458,true,"Chloroplast kinase substrates",60,19376835,"MASCOT Score",37.8200000,,,,,,-1.2498500
VSAQASPR,ph,S,1458,true,"atm and atr DNA damage response",88,25561503,"MASCOT Score",43.0000000,1.0000000,,,,,-0.1200000
VSAQASPR,ph,S,1458,true,"Tissue atlas Arabidopsis - ProteomicsDB",114,32188942,"MaxQuant score",130.9800000,1.0000000,,,,9.7615898654244E-14,
IGTHGTSLESGIPPK,ph,S,1467,true,"Tissue atlas Arabidopsis - ProteomicsDB",114,32188942,"MaxQuant score",131.9600000,0.9531120,,,,1.123220006588E-12,
ADGSEGRPSSSGR,ph,S,1484,true,"Tissue atlas Arabidopsis - ProteomicsDB",114,32188942,"MaxQuant score",204.5100000,0.9331680,,,,0,
ADGSEGRPSSSGR,ph,S,1485,true,"atm and atr DNA damage response",88,25561503,"MASCOT Score",27.0000000,0.9900000,,,,,0.0400000
AQKDVDDVNLQR,ub,K,1491,true,"Arabidopsis ubiquitination COFRADIC",40,26744219,"MaxQuant Score",62.3380000,1.0000000,,,,0.00037090000114404,0.6740000
SQTFGQRFMDNLFLR,ph,T,1503,true,"STN8 phosphoproteome",38,21768351,"MASCOT Score",46.3200000,,,,,,
SQTFGQR,ph,T,1503,true,"TOR Kinase and ABA Receptor",100,29290610,XCorr,2.1668136,0.9125000,,,,0.0052919997833669,
NLTSQPK,ph,T,1518,true,"Large-scale phosphorylation discovery",44,23111157,XCorr,2.0230000,,,,,,
SSVAEVTVPSSPYKHEDPTEPDSREEESPALGAIR,ph,S,1532,true,"PAMP-triggered phosphorylation",48,24601666,"MASCOT Score",50.6000000,,,,,,
SSVAEVTVPSSPYK,ph,S,1532,true,"srk2dei ABA signaling phopshoproteomics",83,23572148,"MASCOT Score",46.0000000,,,,,,-0.0009000
SSVAEVTVPSSPYKHEDPTEPDSREEESPALGAIR,ph,S,1533,true,"Arabidopsis root NAA phosphoproteome",18a,27643528,"MaxQuant Score",106.8100000,0.8970000,,,,6.9170000874542E-19,0.0990000
SSVAEVTVPSSPYKHEDPTEPDSREEESPALGAIR,ph,S,1533,true,"PAMP-triggered phosphorylation",48,24601666,"MASCOT Score",35.7500000,,,,,,
SSVAEVTVPSSPYKHEDPTEPDSREEESPALGAIR,ph,S,1533,true,"Phospho cell culture sucrose/TOR",109,30833711,,,0.8772470,,,,,
SSVAEVTVPSSPYKHEDPTEPDSR,ph,S,1533,true,"PAMP-triggered phosphorylation",48,24601666,"MASCOT Score",34.2400000,,,,,,
SSVAEVTVPSSPYKHEDPTEPDSR,ph,S,1533,true,"Tissue atlas Arabidopsis - ProteomicsDB",114,32188942,"MaxQuant score",260.8200000,0.9959640,,,,0,
SSVAEVTVPSSPYK,ph,S,1533,true,"srk2dei ABA signaling phopshoproteomics",83,23572148,"MASCOT Score",59.0000000,,,,,,0.0005000
SSVAEVTVPSSPYKHEDPTEPDSREEESPALGAIR,ph,Y,1535,true,"PAMP-triggered phosphorylation",48,24601666,"MASCOT Score",60.2800000,,,,,,
SSVAEVTVPSSPYKHEDPTEPDSR,ph,Y,1535,true,"TOR Kinase and ABA Receptor",100,29290610,XCorr,3.7362206,0.7721000,,,,0.0019769999198616,
SSVAEVTVPSSPYK,ph,Y,1535,true,"srk2dei ABA signaling phopshoproteomics",83,23572148,"MASCOT Score",24.0000000,,,,,,-0.0002000
EEESPALGAIR,ph,S,1550,true,"Tissue atlas Arabidopsis - ProteomicsDB",114,32188942,"MaxQuant score",163.4600000,1.0000000,,,,6.2534998013231E-11,
TTSGLADDASNSEDRLEGAAEEK,ph,S,1645,true,"Tissue atlas Arabidopsis - ProteomicsDB",114,32188942,"MaxQuant score",92.6640000,0.9964060,,,,3.2998601073864E-10,
TTSGLADDASNSEDRLEGAAEEK,ph,S,1652,true,"Tissue atlas Arabidopsis - ProteomicsDB",114,32188942,"MaxQuant score",248.1600000,0.9280500,,,,0,
LVSFCEQVLK,so,C,1670,true,"Arabidopsis S-sulfenylation chemoproteomics",108,31578252,"pFind PSM Score",0.2992480,,,,,,-2.1789230
LVSFCEQVLK,so,C,1670,true,"S-sulfenylation site detection using YAP1C",110,32714340,,,,,,,,
LVCCEQMEIR,so,C,1734,true,"S-sulfenylation site detection using YAP1C",110,32714340,,,,,,,,
LVCCEQMEIR,sno,C,1735,true,"hot5-4 / wildtype, FAT-switch S-nitrosoproteome",169,37277371,,,,,,,,
AQLKPLLQQ,ub,K,1753,true,"upl3 mutant / wildtype",168,35926874,"MaxQuant score",82.7500000,1.0000000,-0.1046974,0.8254000,NO,0.0098711801692843,0.6335200
