Peptide,PTM,ModifiedAA,ModifiedPosition,PeptideUniqueToGene,ExperimentDesc,ExpID,PubmedID,ScoreType,IdentScore,LocProb,Log2FChange,PQ-val,QuantSig,PEP,MassErrorPPM
MEGGAALYNPRTVEEVFKD,nta,M,1,true,"HUNTER N-terminome: legumain, GluC and trypsin",119,31951383,"MaxQuant score",68.8200000,,,,,,
MEGGAALYNPRTVEEVFK,nta,M,1,true,"Arabidopsis translation initiation landscape - NTA",167a,35069635,,,,,,,,
MEGGAALYNPR,nta,M,1,true,"Characterization plant N-terminal acetylation",6,22223895,"MASCOT Score",87.3200000,,,,,,
MEGGAALYNPR,nta,M,1,true,"Arg/N-end rule pathway Roots",80,25728785,"MASCOT Score",43.3700000,,,,,0.00026870000874624,
MEGGAALYNPR,nta,M,1,true,"Arg/N-end rule seed, prt6 vs. Wt",99,29168982,"MASCOT Score",91.7500000,,,,,0.00041989999590442,-1.6900623
MEGGAALYNPR,nta,M,1,true,"FtsH12 N-terminome: WT / FtsH12 knockdown miRNA",118,33216923,"MaxQuant score",110.1200000,,,,,0.00010746999760158,
MEGGAALYNPR,nta,M,1,true,"HUNTER N-terminome: legumain, GluC and trypsin",119,31951383,"MaxQuant score",145.1700000,,,,,,
MEGGAALYNP,nta,M,1,true,"N-term acetylation drought responses",5,26184543,,,,,,,,
TVEEVFKDFK,ub,K,18,true,"upl3 mutant / wildtype",168,35926874,"MaxQuant score",78.5130000,1.0000000,1.5690049,,,0.0049951998516917,0.2256900
DKSSAANQNGNK,ph,S,149,true,"atm and atr DNA damage response",88,25561503,"MASCOT Score",56.0000000,0.9540000,,,,,-2.6200000
SSAANQNGNKSK,ph,S,158,true,"atm and atr DNA damage response",88,25561503,"MASCOT Score",32.0000000,1.0000000,,,,,-1.5300000
AEHIKQYK,ac,K,236,false,"Histone deacetylases - apicidin vs control",98a,29061669,"MaxQuant Score",55.5000000,1.0000000,0.4670000,0.1258925,NO,0.010999999940395,
AEHIKQYK,ac,K,236,false,"Histone deacetylases- hda14 vs WT (low light)",98c,29061669,"MaxQuant Score",96.0300000,1.0000000,0.3670000,0.9885531,NO,0.0020000000949949,
AEHIKQYK,ac,K,236,false,"Quantitative Acetylproteomics",101,29440448,,,,,,,,
