Peptide,PTM,ModifiedAA,ModifiedPosition,PeptideUniqueToGene,ExperimentDesc,ExpID,PubmedID,ScoreType,IdentScore,LocProb,Log2FChange,PQ-val,QuantSig,PEP,MassErrorPPM
STSVLDLVVNDR,ph,S,43,true,"atm and atr DNA damage response",88,25561503,"MASCOT Score",63.0000000,0.9980000,,,,,0.1600000
STSVLDLVVNDR,ph,S,43,true,"TOR Kinase and ABA Receptor",100,29290610,XCorr,3.7329617,0.8815000,,,,1.6559999494348E-5,
STSVLDLVVNDR,ph,S,43,true,"Col-0 callus - FC Col-0 vs. Col-0 Xray",111a,31410901,,63.4300000,,0.6766137,0.0000000,NO,,0.2338018
STSVLDLVVNDR,ph,S,43,true,"Col-0 X-ray callus - FC Col-0 vs. Col-0 Xray",111b,31410901,,63.4300000,,0.6766137,0.0000000,NO,,0.2338018
STSVLDLVVNDR,ph,S,43,true,"atm callus - FC atm vs. atm Xray",111c,31410901,,63.4300000,,0.4926223,0.0000000,NO,,0.2338018
STSVLDLVVNDR,ph,S,43,true,"atm-3 X-ray callus - FC atm vs. atm Xray",111d,31410901,,63.4300000,,0.4926223,0.0000000,NO,,0.2338018
STSVLDLVVNDR,ph,S,43,true,"Tissue atlas Arabidopsis - ProteomicsDB",114,32188942,"MaxQuant score",174.8900000,0.9998390,,,,3.8352499886866E-15,
TCSLPVETEEEWRK,ph,S,60,true,"Tissue atlas Arabidopsis - ProteomicsDB",114,32188942,"MaxQuant score",147.1700000,0.9999990,,,,9.0209496761418E-8,
SVETSPSSAQSQPENLGK,ph,S,140,true,"Tissue atlas Arabidopsis - ProteomicsDB",114,32188942,"MaxQuant score",82.7740000,0.8751010,,,,0.00013333999959286,
