Peptide,PTM,ModifiedAA,ModifiedPosition,PeptideUniqueToGene,ExperimentDesc,ExpID,PubmedID,ScoreType,IdentScore,LocProb,Log2FChange,PQ-val,QuantSig,PEP,MassErrorPPM
HQNHHNNTPQFATSPNCCNK,ph,T,23,true,"Tissue atlas Arabidopsis - ProteomicsDB",114,32188942,"MaxQuant score",64.5450000,0.9988400,,,,0.00016398599836975,
HQNHHNNTPQFATSPNCCNK,ph,S,29,true,"Tissue atlas Arabidopsis - ProteomicsDB",114,32188942,"MaxQuant score",126.9000000,0.9867580,,,,8.0082902955848E-24,
KIDDLESSLNK,ph,S,111,true,"Tissue atlas Arabidopsis - ProteomicsDB",114,32188942,"MaxQuant score",146.8400000,0.9183830,,,,2.4520300456743E-8,
HDLTSSAEDDSVDGDEETLVMSR,ph,T,325,true,"Plasmamembrane phosphorylation",20,15308754,,,,,,,,
HDLTSSAEDDSVDGDEETLVMSR,ph,T,325,true,"Conserved plant phosphoproteome - Arabidopsis",61a,20466843,"MASCOT Score",38.0000000,0.8489139,,,,,
HDLTSSAEDDSVDGDEETLVMSR,ph,S,326,true,"Plasmamembrane phosphorylation",20,15308754,,,,,,,,
HDLTSSAEDDSVDGDEETLVMSR,ph,S,327,true,"Plasmamembrane phosphorylation",20,15308754,,,,,,,,
HDLTSSAEDDSVDGDEETLVMSR,ph,S,332,true,"Arabidopsis root NAA phosphoproteome",18a,27643528,"MaxQuant Score",40.3190000,0.9000000,,,,0.0080000003799796,-1.4000000
HDLTSSAEDDSVDGDEETLVMSR,ph,S,332,true,"Plasmamembrane phosphorylation",20,15308754,,,,,,,,
HDLTSSAEDDSVDGDEETLVMSR,ph,S,332,true,"Plasmembrane Ph Immune Responses",25,17651370,,,,,,,,
HDLTSSAEDDSVDGDEETLVMSR,ph,S,332,true,"Phospho cell culture sucrose/TOR",109,30833711,,,0.9999260,,,,,
HDLTSSAEDDSVDGDEETLVMSR,ph,S,332,true,"Tissue atlas Arabidopsis - ProteomicsDB",114,32188942,"MaxQuant score",459.0800000,1.0000000,,,,0,
TVSFDENGNVCK,ph,S,375,true,"Tissue atlas Arabidopsis - ProteomicsDB",114,32188942,"MaxQuant score",159.4400000,0.9999970,,,,6.971300203773E-10,
TVSFDENGNVYK,ph,S,444,true,"Tissue atlas Arabidopsis - ProteomicsDB",114,32188942,"MaxQuant score",187.7800000,0.9999990,,,,2.1991599864332E-20,
