Peptide,PTM,ModifiedAA,ModifiedPosition,PeptideUniqueToGene,ExperimentDesc,ExpID,PubmedID,ScoreType,IdentScore,LocProb,Log2FChange,PQ-val,QuantSig,PEP,MassErrorPPM
TVQEDDKR,nt,T,44,true,"Arg/N-end rule seed, prt6 vs. Wt",99,29168982,"MASCOT Score",30.2700000,,0.1237541,0.4605412,NO,0.013039999641478,-0.2300076
QSLYIKQPTSATSVSE,nt,Q,109,true,"Arg/N-end rule seed, prt6 vs. Wt",99,29168982,"MASCOT Score",32.7500000,,-0.4033619,0.2816482,NO,3.3570000823602E-7,0.7863408
YQQIGFFPKER,ac,K,156,true,"Quantitative Acetylproteomics",101,29440448,,,,,,,,
QGVLGEDDTGEESPR,nt,Q,176,true,"HUNTER N-terminome: legumain, GluC and trypsin",119,31951383,"MaxQuant score",160.1500000,,,,,,
QGVLGEDDTGEESPR,ph,S,188,true,"SnRK2 protein kinase substrates",85,23776212,XCorr,3.1427555,1.0000000,,,,2.808490080497E-6,
QGVLGEDDTGEESPR,ph,S,188,true,"atm and atr DNA damage response",88,25561503,"MASCOT Score",108.0000000,1.0000000,,,,,-0.6000000
QGVLGEDDTGEESPR,ph,S,188,true,"TOR Kinase and ABA Receptor",100,29290610,XCorr,4.1655421,0.8960000,,,,2.4639999537612E-5,
QGVLGEDDTGEESPR,ph,S,188,true,"Tissue atlas Arabidopsis - ProteomicsDB",114,32188942,"MaxQuant score",176.9400000,0.9999410,,,,8.9326903477356E-19,
GQVVQDISSTSDEKK,ac,K,309,true,"Quantitative Acetylproteomics",101,29440448,,,,,,,,
CVADLK,sno,C,352,true,"hot5-4 / wildtype, FAT-switch S-nitrosoproteome",169,37277371,,,,,,,,
