Peptide,PTM,ModifiedAA,ModifiedPosition,PeptideUniqueToGene,ExperimentDesc,ExpID,PubmedID,ScoreType,IdentScore,LocProb,Log2FChange,PQ-val,QuantSig,PEP,MassErrorPPM
DGHFLKTSCGSPNYAAPEVISGK,ph,T,176,false,"PAMP-triggered phosphorylation",48,24601666,"MASCOT Score",48.0000000,,,,,,
DGHFLKTSCGSPNYAAPEVISGK,ph,T,176,false,"srk2dei ABA signaling phopshoproteomics",83,23572148,"MASCOT Score",77.0000000,,,,,,0.0003000
DGHFLKTSCGSPNYAAPEVISGK,ph,T,176,false,"SnRK2 protein kinase substrates",85,23776212,XCorr,4.9158607,0.8760000,,,,2.8833099102732E-13,
DGHFLKTSCGSPNYAAPEVISGK,ph,T,176,false,"Phospho cell culture sucrose/TOR",109,30833711,,,0.9820020,,,,,
DGHFLKTSCGSPNYAAPEVISGK,ph,T,176,false,"Tissue atlas Arabidopsis - ProteomicsDB",114,32188942,"MaxQuant score",445.7400000,0.9991750,,,,0,
TSCGSPNYAAPEVISGK,ph,T,176,false,"srk2dei ABA signaling phopshoproteomics",83,23572148,"MASCOT Score",105.0000000,,,,,,-0.0006000
TSCGSPNYAAPEVISGK,ph,T,176,false,"atm and atr DNA damage response",88,25561503,"MASCOT Score",89.0000000,0.9970000,,,,,0.0200000
TSCGSPNYAAPEVISGK,ph,T,176,false,"Lateral root-induction - NAA vs control",106,23328941,"MASCOT Score",34.0000000,,,,,,
TSCGSPNYAAPEVISGK,ph,T,176,false,"Col-0 callus - FC Col-0 vs. Col-0 Xray",111a,31410901,,71.6100000,,0.8171929,0.0000000,NO,,0.9710720
TSCGSPNYAAPEVISGK,ph,T,176,false,"Col-0 X-ray callus - FC Col-0 vs. Col-0 Xray",111b,31410901,,71.6100000,,0.8171929,0.0000000,NO,,0.9710720
TSCGSPNYAAPEVISGK,ph,T,176,false,"atm callus - FC atm vs. atm Xray",111c,31410901,,71.6100000,,1.1262240,0.0000000,NO,,0.9710720
TSCGSPNYAAPEVISGK,ph,T,176,false,"atm-3 X-ray callus - FC atm vs. atm Xray",111d,31410901,,71.6100000,,1.1262240,0.0000000,NO,,0.9710720
TSCGSPNYAAPEVISGK,ph,T,176,false,"Tissue atlas Arabidopsis - ProteomicsDB",114,32188942,"MaxQuant score",301.4300000,0.9330440,,,,0,
DGHFLKTSCGSPNYAAPEVISGK,ph,S,177,false,"Phosphoproteome ethylene-regulated time response",46,24043427,"MASCOT Score",44.1900000,,,,,,-5.8457000
DGHFLKTSCGSPNYAAPEVISGK,ph,S,177,false,"srk2dei ABA signaling phopshoproteomics",83,23572148,"MASCOT Score",83.0000000,,,,,,0.0005000
DGHFLKTSCGSPNYAAPEVISGK,ph,S,177,false,"Col-0 callus - FC Col-0 vs. Col-0 Xray",111a,31410901,,55.4000000,,0.4259128,0.0000000,NO,,0.6605546
DGHFLKTSCGSPNYAAPEVISGK,ph,S,177,false,"Col-0 X-ray callus - FC Col-0 vs. Col-0 Xray",111b,31410901,,55.4000000,,0.4259128,0.0000000,NO,,0.6605546
DGHFLKTSCGSPNYAAPEVISGK,ph,S,177,false,"atm callus - FC atm vs. atm Xray",111c,31410901,,55.4000000,,0.6430064,0.0000000,NO,,0.6605546
DGHFLKTSCGSPNYAAPEVISGK,ph,S,177,false,"atm-3 X-ray callus - FC atm vs. atm Xray",111d,31410901,,55.4000000,,0.6430064,0.0000000,NO,,0.6605546
DGHFLKTSCGSPNYAAPEVISGK,ph,S,177,false,"Tissue atlas Arabidopsis - ProteomicsDB",114,32188942,"MaxQuant score",353.7300000,0.7681810,,,,0,
TSCGSPNYAAPEVISGK,ph,S,177,false,"Tyrosine phosphorylation in Arabidopsis",59,18463617,"MASCOT Score",83.0000000,,,,,,-0.3852993
TSCGSPNYAAPEVISGK,ph,S,177,false,"srk2dei ABA signaling phopshoproteomics",83,23572148,"MASCOT Score",92.0000000,,,,,,0.0003000
TSCGSPNYAAPEVISGK,ph,S,177,false,"LAXIC - mannitol vs control",84b,23660473,XCorr,4.3200000,0.8810000,,,,0.00045823201071471,
TSCGSPNYAAPEVISGK,ph,S,177,false,"Brassinosteroid-Regulated Phosphorylation Dynamics",94,26187819,"MaxQuant Score",90.8960000,0.8720000,,,,0.0049999998882413,1.3260000
TSCGSPNYAAPEVISGK,ph,S,177,false,"Lateral root-induction - NAA vs control",106,23328941,"MASCOT Score",50.0000000,,,,,,
TSCGSPNYAAPEVISGK,sno,C,178,false,"Site-specific nitrosomeproteomic id - gsnor1-3",90b,25699590,XCorr,2.9800000,,,,,0.026520000770688,-4.7100000
DGHFLKTSCGSPNYAAPEVISGK,ph,S,180,false,"Large-scale phosphorylation discovery",44,23111157,XCorr,4.5360000,,,,,,
DGHFLKTSCGSPNYAAPEVISGK,ph,S,180,false,"srk2dei ABA signaling phopshoproteomics",83,23572148,"MASCOT Score",34.0000000,,,,,,0.0005000
DGHFLKTSCGSPNYAAPEVISGK,ph,S,180,false,"LAXIC - ABA stress",84a,23660473,XCorr,4.6700000,0.8820000,,,,3.2600000849925E-6,
DGHFLKTSCGSPNYAAPEVISGK,ph,S,180,false,"Tissue atlas Arabidopsis - ProteomicsDB",114,32188942,"MaxQuant score",176.8500000,0.7940150,,,,0,
TSCGSPNYAAPEVISGK,ph,S,180,false,"srk2dei ABA signaling phopshoproteomics",83,23572148,"MASCOT Score",50.0000000,,,,,,0.0012000
DGHFLKTSCGSPNYAAPEVISGK,ph,Y,183,false,"srk2dei ABA signaling phopshoproteomics",83,23572148,"MASCOT Score",48.0000000,,,,,,-0.0009000
TSCGSPNYAAPEVISGK,ph,S,190,false,"Conserved plant phosphoproteome - Arabidopsis",61a,20466843,"MASCOT Score",34.0000000,1.0000000,,,,,
TPEAGASPVGHWIPAHVDHYGLGAR,ph,S,366,true,"Arabidopsis root NAA phosphoproteome",18a,27643528,"MaxQuant Score",68.4200000,0.9970000,,,,2.0600000425475E-6,0.0007154
TPEAGASPVGHWIPAHVDHYGLGAR,ph,S,366,true,"TOR Kinase and ABA Receptor",100,29290610,XCorr,4.5546207,0.9995000,,,,1.5889999360752E-7,
TPEAGASPVGHWIPAHVDHYGLGAR,ph,S,366,true,"Phospho cell culture sucrose/TOR",109,30833711,,,1.0000000,,,,,
TPEAGASPVGHWIPAHVDHYGLGAR,ph,S,366,true,"Tissue atlas Arabidopsis - ProteomicsDB",114,32188942,"MaxQuant score",239.2600000,1.0000000,,,,0,
