Peptide,PTM,ModifiedAA,ModifiedPosition,PeptideUniqueToGene,ExperimentDesc,ExpID,PubmedID,ScoreType,IdentScore,LocProb,Log2FChange,PQ-val,QuantSig,PEP,MassErrorPPM
SMDMTPKSPEPESETPTR,ph,S,6,true,"Tissue atlas Arabidopsis - ProteomicsDB",114,32188942,"MaxQuant score",67.8320000,0.9393590,,,,0.00091304397210479,
SMDMTPKSPEPESETPTR,ph,T,10,true,"srk2dei ABA signaling phopshoproteomics",83,23572148,"MASCOT Score",33.0000000,,,,,,0.0011000
SMDMTPKSPEPESETPTR,ph,T,10,true,"atm and atr DNA damage response",88,25561503,"MASCOT Score",33.0000000,1.0000000,,,,,0.9100000
SMDMTPKSPEPESETPTR,ph,T,10,true,"TOR Kinase and ABA Receptor",100,29290610,XCorr,3.2685115,0.8353000,,,,0.0075849997811019,
SMDMTPKSPEPESETPTR,ph,T,10,true,"Tissue atlas Arabidopsis - ProteomicsDB",114,32188942,"MaxQuant score",128.6700000,0.9996760,,,,5.7907996973972E-14,
SMDMTPKSPEPESETPTR,ph,S,13,true,"Large-scale phosphorylation discovery",44,23111157,XCorr,3.6350000,,,,,,
SMDMTPKSPEPESETPTR,ph,S,13,true,"Phosphoproteome ethylene-regulated time response",46,24043427,"MASCOT Score",39.7600000,,,,,,-0.8393200
SMDMTPKSPEPESETPTR,ph,S,13,true,"Chloroplast kinase substrates",60,19376835,"MASCOT Score",46.7700000,,,,,,-0.1774060
SMDMTPKSPEPESETPTR,ph,S,13,true,"srk2dei ABA signaling phopshoproteomics",83,23572148,"MASCOT Score",40.0000000,,,,,,0.0013000
SMDMTPKSPEPESETPTR,ph,S,13,true,"SnRK2 protein kinase substrates",85,23776212,XCorr,3.2416742,1.0000000,,,,0.003643749980256,
SMDMTPKSPEPESETPTR,ph,S,13,true,"atm and atr DNA damage response",88,25561503,"MASCOT Score",37.0000000,1.0000000,,,,,0.1300000
SMDMTPKSPEPESETPTR,ph,S,13,true,"Protein sumoylation and phosphorylation cross-talk",97,28419593,,,,,,,,
SMDMTPKSPEPESETPTR,ph,S,13,true,"TOR Kinase and ABA Receptor",100,29290610,XCorr,4.0983496,1.0000000,,,,0.0017519999528304,
SMDMTPKSPEPESETPTR,ph,S,13,true,"Touch-induced phosphorylation: 40s touch vs untouc",136,30291188,"MASCOT score",62.1500000,,-0.0888961,0.2614487,NO,,-0.2849801
SPEPESETPTR,ph,S,13,false,"LAXIC - ABA stress",84a,23660473,XCorr,2.8600000,1.0000000,,,,0.015025800094008,
SPEPESETPTR,ph,S,13,false,"LAXIC - mannitol vs control",84b,23660473,XCorr,2.6500000,1.0000000,,,,0.002247849944979,
SPEPESETPTR,ph,S,13,false,"SnRK2 protein kinase substrates",85,23776212,XCorr,2.8971102,1.0000000,,,,0.014418300241232,
SPEPESETPTR,ph,S,13,false,"atm and atr DNA damage response",88,25561503,"MASCOT Score",40.0000000,1.0000000,,,,,0.4000000
SPEPESETPTR,ph,S,13,false,"TOR Kinase and ABA Receptor",100,29290610,XCorr,2.4917448,1.0000000,,,,0.0176199991256,
SPEPESETPTR,ph,S,13,false,"Tissue atlas Arabidopsis - ProteomicsDB",114,32188942,"MaxQuant score",212.8500000,1.0000000,,,,0,
SMDMTPKSPEPESETPTR,ph,T,20,true,"SnRK2 protein kinase substrates",85,23776212,XCorr,3.2416742,0.9710000,,,,0.003643749980256,
SMDMTPKSPEPESETPTR,ph,T,20,true,"atm and atr DNA damage response",88,25561503,"MASCOT Score",30.0000000,0.9820000,,,,,0.2100000
SMDMTPKSPEPESETPTR,ph,T,20,true,"TOR Kinase and ABA Receptor",100,29290610,XCorr,3.9010079,0.8643000,,,,0.00053080002544448,
SMDMTPKSPEPESETPTR,ph,T,20,true,"Tissue atlas Arabidopsis - ProteomicsDB",114,32188942,"MaxQuant score",197.2800000,0.9558780,,,,2.8025969286496E-45,
SPEPESETPTR,ph,T,20,false,"atm and atr DNA damage response",88,25561503,"MASCOT Score",40.0000000,0.9980000,,,,,0.4000000
SPEPESETPTR,ph,T,20,false,"Tissue atlas Arabidopsis - ProteomicsDB",114,32188942,"MaxQuant score",128.4600000,0.9010570,,,,2.1473399101524E-5,
SPEPESETPTR,ph,T,22,false,"LAXIC - mannitol vs control",84b,23660473,XCorr,2.5600000,0.8800000,,,,0.0015501199522987,
IQPAKPISFSNGIIK,ph,S,31,false,"Tissue atlas Arabidopsis - ProteomicsDB",114,32188942,"MaxQuant score",85.9370000,0.9772800,,,,4.1256498661824E-5,
IQPAKPISFSNGIIK,ph,S,33,false,"Tissue atlas Arabidopsis - ProteomicsDB",114,32188942,"MaxQuant score",79.5110000,0.9918230,,,,6.9073001213837E-5,
IQPAKPISFSNGIIKR,ac,K,38,false,"Quantitative Acetylproteomics",101,29440448,,,,,,,,
TAPFSDLNFAAAANHLSATPGSR,ph,S,186,true,"Tissue atlas Arabidopsis - ProteomicsDB",114,32188942,"MaxQuant score",112.5700000,0.9494520,,,,6.6811000881549E-17,
TAPFSDLNFAAAANHLSATPGSR,ph,T,188,true,"Tissue atlas Arabidopsis - ProteomicsDB",114,32188942,"MaxQuant score",59.5610000,0.8022280,,,,0.0001730609947117,
VWMHNNKNSFK,ph,S,250,true,"srk2dei ABA signaling phopshoproteomics",83,23572148,"MASCOT Score",20.0000000,,,,,,-0.0004000
VWMHNNKNSFK,ph,S,250,true,"Tissue atlas Arabidopsis - ProteomicsDB",114,32188942,"MaxQuant score",140.0300000,1.0000000,,,,2.1518600590298E-7,
NDNGIGGENSNDDGVRGLANDGDGGGGR,ph,S,273,true,"STN8 phosphoproteome",38,21768351,"MASCOT Score",91.9200000,,,,,,-0.7500290
NDNGIGGENSNDDGVRGLANDGDGGGGR,ph,S,273,true,"Chloroplast kinase substrates",60,19376835,"MASCOT Score",68.5800000,,,,,,-0.7500290
NDNGIGGENSNDDGVR,ph,S,273,true,"STN8 phosphoproteome",38,21768351,"MASCOT Score",92.4000000,,,,,,-0.7401610
NDNGIGGENSNDDGVR,ph,S,273,true,"Chloroplast kinase substrates",60,19376835,"MASCOT Score",67.7200000,,,,,,-2.4908000
NDNGIGGENSNDDGVR,ph,S,273,true,"srk2dei ABA signaling phopshoproteomics",83,23572148,"MASCOT Score",46.0000000,,,,,,-0.0003000
NDNGIGGENSNDDGVR,ph,S,273,true,"LAXIC - ABA stress",84a,23660473,XCorr,3.9300000,1.0000000,,,,0.00017934500647243,
NDNGIGGENSNDDGVR,ph,S,273,true,"LAXIC - mannitol vs control",84b,23660473,XCorr,4.1300000,1.0000000,-1.4718180,,NO,4.3000000791257E-16,
NDNGIGGENSNDDGVR,ph,S,273,true,"SnRK2 protein kinase substrates",85,23776212,XCorr,3.8264811,1.0000000,,,,4.923210144625E-5,
NDNGIGGENSNDDGVR,ph,S,273,true,"atm and atr DNA damage response",88,25561503,"MASCOT Score",110.0000000,1.0000000,,,,,-0.5000000
NDNGIGGENSNDDGVR,ph,S,273,true,"TOR Kinase and ABA Receptor",100,29290610,XCorr,5.4104347,1.0000000,,,,4.8610002068017E-7,
NDNGIGGENSNDDGVR,ph,S,273,true,"Tissue atlas Arabidopsis - ProteomicsDB",114,32188942,"MaxQuant score",303.7600000,1.0000000,,,,0,
FESDSGGADGGGNVNASSSSS,ph,S,311,true,"atm and atr DNA damage response",88,25561503,"MASCOT Score",99.0000000,0.9090000,,,,,0.8200000
